Peptide,PTM,ModifiedAA,ModifiedPosition,PeptideUniqueToGene,ExperimentDesc,ExpID,PubmedID,ScoreType,IdentScore,LocProb,Log2FChange,PQ-val,QuantSig,PEP,MassErrorPPM
SSSESVENECMCW,nt,S,2,true,"Arg/N-end rule seed, prt6 vs. Wt",99,29168982,"MASCOT Score",34.1400000,,,,,0.03957000002265,-1.4672164
SSSESVENECMCWAAR,nta,S,2,true,"FtsH12 N-terminome: WT / FtsH12 knockdown miRNA",118,33216923,"MaxQuant score",141.4800000,,,,,2.6699999011726E-7,
SSSESVENECMCWAAR,nta,S,2,true,"HUNTER N-terminome: legumain, GluC and trypsin",119,31951383,"MaxQuant score",192.3000000,,,,,,
SSSESVENECMCW,nta,S,2,true,"Arg/N-end rule seed, prt6 vs. Wt",99,29168982,"MASCOT Score",34.1400000,,,,,0.03957000002265,-1.4672164
DPSGLLSPHTITR,ph,S,24,true,"atm and atr DNA damage response",88,25561503,"MASCOT Score",63.0000000,0.9990000,,,,,-1.0100000
DPSGLLSPHTITR,ph,S,24,true,"Lateral root-induction - NAA vs control",106,23328941,"MASCOT Score",24.0000000,,,,,,
DPSGLLSPHTITR,ph,S,24,true,"Phospho cell culture sucrose/TOR",109,30833711,,,0.8776750,,,,,
DPSGLLSPHTITR,ph,S,24,true,"Tissue atlas Arabidopsis - ProteomicsDB",114,32188942,"MaxQuant score",216.7100000,0.9999060,,,,0,
NQHGDSKYPLVPGHEIAGIVTKVGPNVQR,nt,N,57,true,"Arabidopsis translation initiation landscape - NT",167b,35069635,,,,,,,,
QHGDSKYPLVPGHEIAGIVTKVGPNVQR,nta,Q,58,true,"Arabidopsis translation initiation landscape - NTA",167a,35069635,,,,,,,,
VGDHVGVGTYVNSCR,so,C,101,true,"Arabidopsis S-sulfenylation chemoproteomics",108,31578252,"pFind PSM Score",0.0193869,,,,,,-0.8905190
SGDHAFDPY,nt,S,254,true,"N-terminal ChaFRADIC",92,26010716,"MASCOT Score",21.4900000,,,,,0.0073500000871718,
GTYVLVGFPSE,nt,G,270,true,"Arg/N-end rule seed, prt6 vs. Wt",99,29168982,"MASCOT Score",39.0000000,,-0.1924421,0.7073878,NO,0.00036410000757314,2.0581297
ISPANLNLGMR,ph,S,284,true,"Tissue atlas Arabidopsis - ProteomicsDB",114,32188942,"MaxQuant score",71.1590000,1.0000000,,,,0.00078704598126933,
ITQQMLDFCAAHK,sno,C,313,true,"Site-specific nitrosomeproteomic id - gsnor1-3",90b,25699590,XCorr,2.4643288,,,,,0.098860003054142,-7.7368062
ITQQMLDFCAAHK,so,C,313,true,"Arabidopsis S-sulfenylation chemoproteomics",108,31578252,"pFind PSM Score",0.0003172,,0.9912300,,,,-1.1393374
ITQQMLDFCAAHK,so,C,313,true,"S-sulfenylation site detection using YAP1C",110,32714340,,,,,,,,
