Peptide,PTM,ModifiedAA,ModifiedPosition,PeptideUniqueToGene,ExperimentDesc,ExpID,PubmedID,ScoreType,IdentScore,LocProb,Log2FChange,PQ-val,QuantSig,PEP,MassErrorPPM
YIEELSETDDKQQNDK,ph,S,365,true,"Tissue atlas Arabidopsis - ProteomicsDB",114,32188942,"MaxQuant score",172.9300000,0.9983870,,,,3.943479914276E-19,
LSEKSEVR,ub,K,388,true,"Arabidopsis ubiquitination COFRADIC",40,26744219,"MaxQuant Score",111.9500000,1.0000000,,,,0.0040000001899898,-1.0170000
ASAAESNLNLSPSQLSSEVVNR,ph,S,457,true,"Large-scale phosphorylation discovery",44,23111157,XCorr,3.4410000,,,,,,
ASAAESNLNLSPSQLSSEVVNR,ph,S,457,true,"Tissue atlas Arabidopsis - ProteomicsDB",114,32188942,"MaxQuant score",337.4100000,1.0000000,,,,0,
ASAAESNLNLSPSQLSSEVVNR,ph,S,462,true,"Tissue atlas Arabidopsis - ProteomicsDB",114,32188942,"MaxQuant score",196.6100000,0.8342270,,,,0,
DSVEKSASR,ub,K,473,true,"Arabidopsis ubiquitination COFRADIC",40,26744219,"MaxQuant Score",67.8970000,1.0000000,,,,0.0070000002160668,-0.9590000
TSFAQSPSNSVGSLK,ph,S,591,true,"Tissue atlas Arabidopsis - ProteomicsDB",114,32188942,"MaxQuant score",216.7700000,0.9999110,,,,0,
TSFAQSPSNSVGSLKK,ph,S,595,true,"Tissue atlas Arabidopsis - ProteomicsDB",114,32188942,"MaxQuant score",86.0360000,0.8050400,,,,4.1016301111085E-5,
