Peptide,PTM,ModifiedAA,ModifiedPosition,PeptideUniqueToGene,ExperimentDesc,ExpID,PubmedID,ScoreType,IdentScore,LocProb,Log2FChange,PQ-val,QuantSig,PEP,MassErrorPPM
PTISVGRDR,ph,T,3,true,"SIRK1 phosphorylation",86a,23820729,"MaxQuant Score",83.8960000,1.0000000,,,,0.28299999237061,3.6750000
PTISVGRDR,ph,T,3,true,"SIRK1 exp - sirk1 mutant vs WT",86b,23820729,,,,0.1324317,,NO,,
PTISVGRDR,ph,T,3,true,"SIRK1 exp - 35S:SIRK1 vs WT",86c,23820729,,,,0.8968358,,NO,,
LHQNICR,so,C,152,true,"Arabidopsis S-sulfenylation chemoproteomics",108,31578252,"pFind PSM Score",0.2841290,,1.1363600,,,,-0.4198508
NVFIECTATDLTK,ox,C,256,true,"SPEAR - 10 mM H2O2 / mock",138a,34619326,,,,-4.8868668,0.0208566,YES,,
NVFIECTATDLTK,ox,C,256,true,"SPEAR - 50 mM H2O2 / mock",138b,34619326,,,,0.9326520,0.0246774,YES,,
NVFIECTATDLTK,so,C,256,true,"S-sulfenylation site detection using YAP1C",110,32714340,,,,,,,,
SSDNQCAIK,sno,C,349,true,"hot5-4 / wildtype, FAT-switch S-nitrosoproteome",169,37277371,,,,0.6953459,0.0002261,YES,,
SADFEAMR,ph,S,444,true,"atm and atr DNA damage response",88,25561503,"MASCOT Score",24.0000000,1.0000000,,,,,-0.4600000
