Peptide,PTM,ModifiedAA,ModifiedPosition,PeptideUniqueToGene,ExperimentDesc,ExpID,PubmedID,ScoreType,IdentScore,LocProb,Log2FChange,PQ-val,QuantSig,PEP,MassErrorPPM
SKIKPLSKSSQD,nta,S,2,true,"Arabidopsis translation initiation landscape - NTA",167a,35069635,,,,,,,,
KAENDENVVEVDHDGVEKSSR,ph,S,668,true,"Tissue atlas Arabidopsis - ProteomicsDB",114,32188942,"MaxQuant score",250.7000000,1.0000000,,,,0,
KAENDENVVEVDHDGVEKSSR,ph,S,669,true,"Tissue atlas Arabidopsis - ProteomicsDB",114,32188942,"MaxQuant score",158.2900000,1.0000000,,,,3.0020300600452E-29,
DGDSSSDDEEALAIR,ph,S,674,true,"Tissue atlas Arabidopsis - ProteomicsDB",114,32188942,"MaxQuant score",77.3050000,1.0000000,,,,7.0354901254177E-5,
DGDSSSDDEEALAIR,ph,S,676,true,"Tyrosine phosphorylation in Arabidopsis",59,18463617,"MASCOT Score",29.0000000,,,,,,-0.0602907
DGDSSSDDEEALAIR,ph,S,676,true,"Tissue atlas Arabidopsis - ProteomicsDB",114,32188942,"MaxQuant score",115.9100000,1.0000000,,,,4.2436299736437E-6,
LSDEEDDNASDDSEELIR,ph,S,687,true,"Tissue atlas Arabidopsis - ProteomicsDB",114,32188942,"MaxQuant score",133.2100000,1.0000000,,,,9.2481902488661E-22,
LSDEEDDNASDDSEELIR,ph,S,695,true,"Phospho cell culture sucrose/TOR",109,30833711,,,0.9901070,,,,,
LSDEEDDNASDDSEELIR,ph,S,695,true,"Tissue atlas Arabidopsis - ProteomicsDB",114,32188942,"MaxQuant score",133.2100000,1.0000000,,,,9.2481902488661E-22,
NETPQLEEVMEVSNDMEKR,ph,T,706,true,"Tissue atlas Arabidopsis - ProteomicsDB",114,32188942,"MaxQuant score",200.1700000,1.0000000,,,,0,
NETPQLEEVMEVSNDMEK,ph,S,716,true,"Tissue atlas Arabidopsis - ProteomicsDB",114,32188942,"MaxQuant score",159.7700000,1.0000000,,,,4.4919299994611E-22,
