Peptide,PTM,ModifiedAA,ModifiedPosition,PeptideUniqueToGene,ExperimentDesc,ExpID,PubmedID,ScoreType,IdentScore,LocProb,Log2FChange,PQ-val,QuantSig,PEP,MassErrorPPM
ATNGSASSAQLSQKEADVR,nt,A,2,true,"N-terminal ChaFRADIC",92,26010716,"MASCOT Score",61.1300000,,,,,3.8420000691985E-7,
ATNGSASSAQLSQKEADVR,nt,A,2,true,"Stromal N-terminome",96,26371235,"MASCOT Score",73.1300000,,,,,,
ATNGSASSAQLSQKEADVR,nt,A,2,true,"Arg/N-end rule seed, prt6 vs. Wt",99,29168982,"MASCOT Score",60.6300000,,,,,9.3280003056861E-5,-2.5251755
ATNGSASSAQLSQKEADVR,nt,A,2,true,"FtsH12 N-terminome: WT / FtsH12 knockdown miRNA",118,33216923,"MaxQuant score",108.4300000,,-0.6484928,0.0261136,YES,1.0700000334857E-29,
ATNGSASSAQLSQKE,nt,A,2,true,"N-terminal ChaFRADIC",92,26010716,"MASCOT Score",59.1400000,,,,,9.7999996796716E-5,
ATNGSASSAQLSQKE,nt,A,2,true,"Arg/N-end rule seed, prt6 vs. Wt",99,29168982,"MASCOT Score",87.3900000,,,,,3.3450000581914E-12,-1.2195695
ATNGSASSAQ,nt,A,2,true,"N-term acetylation drought responses",5,26184543,,,,,,,,
ATNGSASSAQLSQKEADVR,nta,A,2,true,"Arg/N-end rule pathway Roots",80,25728785,"MASCOT Score",105.6900000,,,,,1.7220000425588E-10,
ATNGSASSAQLSQKEADVR,nta,A,2,true,"N-terminal ChaFRADIC",92,26010716,"MASCOT Score",61.1300000,,,,,3.8420000691985E-7,
ATNGSASSAQLSQKEADVR,nta,A,2,true,"Stromal N-terminome",96,26371235,"MASCOT Score",73.1300000,,,,,,
ATNGSASSAQLSQKEADVR,nta,A,2,true,"Arg/N-end rule seed, prt6 vs. Wt",99,29168982,"MASCOT Score",60.6300000,,0.1447083,0.2818978,NO,9.3280003056861E-5,-2.5251755
ATNGSASSAQLSQKEADVR,nta,A,2,true,"HUNTER N-terminome: legumain, GluC and trypsin",119,31951383,"MaxQuant score",166.4800000,,,,,,
ATNGSASSAQLSQKEADVR,nta,A,2,true,"Arabidopsis translation initiation landscape - NTA",167a,35069635,,,,,,,,
ATNGSASSAQLSQKE,nta,A,2,true,"N-terminal ChaFRADIC",92,26010716,"MASCOT Score",59.1400000,,,,,9.7999996796716E-5,
ATNGSASSAQLSQKE,nta,A,2,true,"Arg/N-end rule seed, prt6 vs. Wt",99,29168982,"MASCOT Score",87.3900000,,-0.0161741,0.8963727,NO,3.3450000581914E-12,-1.2195695
ATNGSASSAQLSQKE,nta,A,2,true,"HUNTER N-terminome: legumain, GluC and trypsin",119,31951383,"MaxQuant score",,,,,,,
ATNGSASSAQLSQK,nta,A,2,true,"Characterization plant N-terminal acetylation",6,22223895,"MASCOT Score",98.5600000,,,,,,
ATNGSASSAQLSQK,nta,A,2,true,"Arg/N-end rule pathway Roots",80,25728785,"MASCOT Score",85.5100000,,,,,6.486999950539E-7,
ATNGSASSAQ,nta,A,2,true,"N-term acetylation drought responses",5,26184543,,,,,,,,
ATNGSASSAQLSQK,ph,T,3,true,"Chloroplast kinase substrates",60,19376835,"MASCOT Score",34.6600000,,,,,,1.1432800
ATNGSASSAQLSQK,ph,T,3,true,"Lateral root-induction - NAA vs control",106,23328941,"MASCOT Score",29.0000000,,0.6000048,0.0164455,YES,,
ATNGSASSAQLSQK,ph,T,3,true,"Tissue atlas Arabidopsis - ProteomicsDB",114,32188942,"MaxQuant score",161.4900000,0.9999500,,,,4.4367100271447E-11,
ATNGSASSAQLSQK,ng,N,4,true,"Conserved N-glycosylation",74,22633491,"MaxQuant Score",125.5200000,1.0000000,,,,1.6069999877241E-13,-0.2840000
ATNGSASSAQLSQK,ph,S,6,true,"atm and atr DNA damage response",88,25561503,"MASCOT Score",54.0000000,0.9700000,,,,,-0.3100000
ATNGSASSAQLSQK,ph,S,6,true,"Tissue atlas Arabidopsis - ProteomicsDB",114,32188942,"MaxQuant score",249.3600000,1.0000000,,,,0,
ATNGSASSAQLSQK,ph,S,8,true,"atm and atr DNA damage response",88,25561503,"MASCOT Score",52.0000000,0.8340000,,,,,-0.4600000
ATNGSASSAQLSQK,ph,S,8,true,"Tissue atlas Arabidopsis - ProteomicsDB",114,32188942,"MaxQuant score",265.1000000,0.8430770,,,,0,
ATNGSASSAQLSQK,ph,S,9,true,"atm and atr DNA damage response",88,25561503,"MASCOT Score",65.0000000,0.9050000,,,,,0.0700000
ATNGSASSAQLSQK,ph,S,9,true,"Tissue atlas Arabidopsis - ProteomicsDB",114,32188942,"MaxQuant score",157.3700000,0.9321150,,,,5.549459849985E-11,
ATNGSASSAQLSQKEADVR,ub,K,15,true,"Arabidopsis ubiquitination COFRADIC",40,26744219,"MaxQuant Score",101.9200000,1.0000000,,,,7.1090002106081E-21,0.4400000
MMCAAEVHLGTKNCNYQMER,nt,M,21,true,"Arabidopsis translation initiation landscape - NT",167b,35069635,,,,,,,,
MMCAAEVHLGTK,acy,C,23,true,"Arabidopsis S-acylation atlas - Silique",163e,35681017,,,,,,,,
MMCAAEVHLGTK,so,C,23,true,"Arabidopsis S-sulfenylation chemoproteomics",108,31578252,"pFind PSM Score",0.0008701,,0.9913800,,,,-1.2860028
MMCAAEVHLGTK,so,C,23,true,"S-sulfenylation site detection using YAP1C",110,32714340,,,,,,,,
NCNYQMER,nt,N,33,false,"Metacaspase9 substrates - 35S:MC9 / mc9",51b,23964026,"MASCOT Score",45.0000000,,1.5437290,,NO,,-0.8309207
NCNYQMER,nt,N,33,false,"Metacaspase9 substrates - in vitro rMC9",51c,23964026,"MASCOT Score",48.0000000,,,,,,-0.0833702
NCNYQMER,ox,C,34,false,"OxiTRAQ Arabidopsis - 5 mM H2O2 versus control",47,24376095,,,,0.0958951,0.2842307,NO,,
NCNYQMER,sno,C,34,false,"Site-specific nitrosomeproteomic id - gsnor1-3",90a,25699590,XCorr,2.1707404,,,,,0.21150000393391,-6.8414846
NCNYQMER,sno,C,34,false,"hot5-4 / wildtype, FAT-switch S-nitrosoproteome",169,37277371,,,,,,,,
NCNYQMER,so,C,34,false,"S-sulfenylation site detection using YAP1C",110,32714340,,,,,,,,
DIIVQSARPYGQRAVLK,ph,S,82,false,"Tissue atlas Arabidopsis - ProteomicsDB",114,32188942,"MaxQuant score",47.0470000,0.9926690,,,,0.0019928601104766,
AVLKFAQYTGANAIAGR,nt,A,90,true,"Arabidopsis translation initiation landscape - NT",167b,35069635,,,,,,,,
AVLKFAQYTGANAIAGR,ub,K,93,true,"Ubiquitination Membrane Proteins",120,33585938,,,,,,,,
TGANAIAGRHTPGTF,nt,T,98,true,"Arabidopsis translation initiation landscape - NT",167b,35069635,,,,,,,,
HTPGTFTNQMQTSFSEPR,ph,T,108,false,"atm and atr DNA damage response",88,25561503,"MASCOT Score",42.0000000,1.0000000,,,,,0.2200000
HTPGTFTNQMQTSFSEPR,ph,T,108,false,"Tissue atlas Arabidopsis - ProteomicsDB",114,32188942,"MaxQuant score",134.0800000,0.9720700,,,,6.9906598989622E-15,
QMQTSFSEPRLLILTDPRTDHQPIKEGALGN,nt,Q,115,false,"HUNTER N-terminome: legumain, GluC and trypsin",119,31951383,"MaxQuant score",55.4130000,,,,,,
QMQTSFSEPRLLILTDPRTD,nt,Q,115,false,"HUNTER N-terminome: legumain, GluC and trypsin",119,31951383,"MaxQuant score",89.0280000,,,,,,
HTPGTFTNQMQTSFSEPR,ph,S,121,false,"Tissue atlas Arabidopsis - ProteomicsDB",114,32188942,"MaxQuant score",94.3840000,0.9221860,,,,3.0176399832271E-6,
CDTDSPMR,nt,C,152,true,"Metacaspase9 substrates - 35S:MC9 / mc9",51b,23964026,"MASCOT Score",45.0000000,,1.0271696,,NO,,-0.9342124
EGALGNIPIIAFCDTDSPMR,sno,C,152,true,"hot5-4 / wildtype, FAT-switch S-nitrosoproteome",169,37277371,,,,,,,,
TDHQPIKEGALGNIPIIAFCDTDSPMR,so,C,152,true,"S-sulfenylation site detection using YAP1C",110,32714340,,,,,,,,
SAAAPADGGWE,nt,S,274,true,"Arg/N-end rule seed, prt6 vs. Wt",99,29168982,"MASCOT Score",43.5900000,,-0.7611163,0.0635190,NO,0.053459998220205,3.6949807
