Peptide,PTM,ModifiedAA,ModifiedPosition,PeptideUniqueToGene,ExperimentDesc,ExpID,PubmedID,ScoreType,IdentScore,LocProb,Log2FChange,PQ-val,QuantSig,PEP,MassErrorPPM
RSPSFILDER,ph,S,5,true,"atm and atr DNA damage response",88,25561503,"MASCOT Score",36.0000000,0.9980000,,,,,-0.6200000
RSPSFILDER,ph,S,5,true,"Tissue atlas Arabidopsis - ProteomicsDB",114,32188942,"MaxQuant score",152.1600000,0.9101980,,,,6.9151298021097E-7,
RSPSFILDERR,ph,S,7,true,"STN8 phosphoproteome",38,21768351,"MASCOT Score",45.9200000,,,,,,0.4294960
RSPSFILDERR,ph,S,7,true,"TOR Kinase and ABA Receptor",100,29290610,XCorr,2.6760156,0.9878000,,,,0.0027250000275671,
RSPSFILDER,ph,S,7,true,"STN8 phosphoproteome",38,21768351,"MASCOT Score",56.3800000,,,,,,1.0061500
RSPSFILDER,ph,S,7,true,"srk2dei ABA signaling phopshoproteomics",83,23572148,"MASCOT Score",45.0000000,,,,,,0.0001000
RSPSFILDER,ph,S,7,true,"SnRK2 protein kinase substrates",85,23776212,XCorr,2.4686277,1.0000000,,,,0.025625199079514,
RSPSFILDER,ph,S,7,true,"atm and atr DNA damage response",88,25561503,"MASCOT Score",58.0000000,0.9950000,,,,,-0.1800000
RSPSFILDER,ph,S,7,true,"TOR Kinase and ABA Receptor",100,29290610,XCorr,3.2629681,0.9991000,,,,0.0021889999043196,
SPSFILDER,ph,S,7,true,"STN8 phosphoproteome",38,21768351,"MASCOT Score",47.6500000,,,,,,-0.7185420
SPSFILDER,ph,S,7,true,"Tyrosine phosphorylation in Arabidopsis",59,18463617,"MASCOT Score",57.0000000,,,,,,-2.3632421
SPSFILDER,ph,S,7,true,"Chloroplast kinase substrates",60,19376835,"MASCOT Score",35.8900000,,,,,,0.2775130
SPSFILDER,ph,S,7,true,"srk2dei ABA signaling phopshoproteomics",83,23572148,"MASCOT Score",52.0000000,,,,,,0.0003000
SPSFILDER,ph,S,7,true,"LAXIC - ABA stress",84a,23660473,XCorr,3.0700000,1.0000000,,,,0.0024116400163621,
SPSFILDER,ph,S,7,true,"LAXIC - mannitol vs control",84b,23660473,XCorr,2.1300000,0.9990000,,,,0.041105099022388,
SPSFILDER,ph,S,7,true,"SnRK2 protein kinase substrates",85,23776212,XCorr,2.4502127,0.9950000,,,,0.032005701214075,
SPSFILDER,ph,S,7,true,"atm and atr DNA damage response",88,25561503,"MASCOT Score",43.0000000,1.0000000,,,,,0.4600000
SPSFILDER,ph,S,7,true,"TOR Kinase and ABA Receptor",100,29290610,XCorr,3.9535215,0.9964000,,,,9.4440001703333E-6,
SPSFILDER,ph,S,7,true,"Phospho cell culture sucrose/TOR",109,30833711,,,0.9998720,,,,,
SPSFILDER,ph,S,7,true,"Tissue atlas Arabidopsis - ProteomicsDB",114,32188942,"MaxQuant score",214.0800000,0.9999900,,,,6.8803299571899E-23,
RSSNSPPMADTTR,ph,S,15,true,"atm and atr DNA damage response",88,25561503,"MASCOT Score",26.0000000,0.9450000,,,,,-0.0100000
RSSNSPPMADTTR,ph,S,16,true,"atm and atr DNA damage response",88,25561503,"MASCOT Score",35.0000000,0.9330000,,,,,-0.1200000
RSSNSPPMADTTR,ph,S,16,true,"TOR Kinase and ABA Receptor",100,29290610,XCorr,4.8468013,0.9866000,,,,1.3769999895885E-5,
RSSNSPPMADTTR,ph,S,18,true,"SnRK2 protein kinase substrates",85,23776212,XCorr,2.2863019,1.0000000,,,,0.00088122201850638,
RSSNSPPMADTTR,ph,S,18,true,"atm and atr DNA damage response",88,25561503,"MASCOT Score",50.0000000,1.0000000,,,,,-0.5300000
RSSNSPPMADTTR,ph,S,18,true,"TOR Kinase and ABA Receptor",100,29290610,XCorr,4.8468013,0.9997000,,,,1.3769999895885E-5,
SSNSPPMADTTR,ph,S,18,true,"Chloroplast kinase substrates",60,19376835,"MASCOT Score",31.5200000,,,,,,0.2220970
SSNSPPMADTTR,ph,S,18,true,"SnRK2 protein kinase substrates",85,23776212,XCorr,2.4151258,0.9800000,,,,0.029736999422312,
SSNSPPMADTTR,ph,S,18,true,"atm and atr DNA damage response",88,25561503,"MASCOT Score",55.0000000,1.0000000,,,,,0.0300000
SSNSPPMADTTR,ph,S,18,true,"TOR Kinase and ABA Receptor",100,29290610,XCorr,3.0033937,0.8306000,,,,0.0029639999847859,
SSNSPPMADTTR,ph,S,18,true,"Lateral root-induction - NAA vs control",106,23328941,"MASCOT Score",69.0000000,,,,,,
SSNSPPMADTTR,ph,S,18,true,"Phospho cell culture sucrose/TOR",109,30833711,,,0.9992690,,,,,
SSNSPPMADTTR,ph,S,18,true,"Tissue atlas Arabidopsis - ProteomicsDB",114,32188942,"MaxQuant score",135.5000000,0.9999860,,,,9.6468402261962E-6,
GPFQNPDSISAYYQTR,ph,S,34,true,"Tissue atlas Arabidopsis - ProteomicsDB",114,32188942,"MaxQuant score",185.2600000,0.9997690,,,,9.4382099743482E-27,
FGEISCK,sno,C,185,false,"hot5-4 / wildtype, FAT-switch S-nitrosoproteome",169,37277371,,,,0.6221060,0.0119412,YES,,
