Peptide,PTM,ModifiedAA,ModifiedPosition,PeptideUniqueToGene,ExperimentDesc,ExpID,PubmedID,ScoreType,IdentScore,LocProb,Log2FChange,PQ-val,QuantSig,PEP,MassErrorPPM
SSTSEMSASDSTSSLPVTLDSINPKVLKCEYAVR,nt,S,47,true,"Mitochondrial intermediate peptidases - icp55 / WT",131a,25732537,,85.8800000,,-1.4615675,,,,
SSTSEMSASDSTSSLPVTLDSINPKVLKCEYAVR,nt,S,47,true,"Mitochondrial intermediate peptidases - oct1-1 / WT",131b,25732537,,83.6000000,,-0.6769302,,,,
SSTSEMSASDSTSSLPVTLDSINPKVLKCEYAVR,nt,S,47,true,"Mitochondrial intermediate peptidases - oct1-2 / WT",131c,25732537,,60.4500000,,-0.5370159,,,,
SSTSEMSASDSTSSLPVTLDSINPKVLK,nt,S,47,true,"Arabidopsis translation initiation landscape - NT",167b,35069635,,,,,,,,
SASDSTSSLPVTLDSINPKVLKCEYAVR,nta,S,53,true,"Arabidopsis translation initiation landscape - NTA",167a,35069635,,,,,,,,
SASDSTSSLPVTLDSINPK,nta,S,53,true,"Characterization plant N-terminal acetylation",6,22223895,"MASCOT Score",47.2100000,,,,,,
CEYAVR,ox,C,75,false,"OxiTRAQ Arabidopsis - 5 mM H2O2 versus control",47,24376095,,,,0.1061699,0.1719037,NO,,
CEYAVR,sno,C,75,false,"hot5-4 / wildtype, FAT-switch S-nitrosoproteome",169,37277371,,,,,,,,
CEYAVR,so,C,75,false,"S-sulfenylation site detection using YAP1C",110,32714340,,,,,,,,
EVLALCDHASLLDESETHGLFSTDSIDR,so,C,132,true,"Arabidopsis S-sulfenylation chemoproteomics",108,31578252,"pFind PSM Score",0.0305294,,0.9259300,,,,-0.8259895
EVLALCDHASLLDESETHGLFSTDSIDR,so,C,132,true,"S-sulfenylation site detection using YAP1C",110,32714340,,,,,,,,
ATGAYSHSQGIKGLR,nt,A,166,false,"Arabidopsis translation initiation landscape - NT",167b,35069635,,,,,,,,
ATGAYSHSQGIK,ph,S,171,false,"Tissue atlas Arabidopsis - ProteomicsDB",114,32188942,"MaxQuant score",73.7220000,0.9084260,,,,0.0027310999576002,
ATGAYSHSQGIK,ph,S,173,false,"Tissue atlas Arabidopsis - ProteomicsDB",114,32188942,"MaxQuant score",179.5500000,0.9954020,,,,1.239070028695E-19,
ATGAYSHSQGIKGLR,ub,K,177,false,"upl3 mutant / wildtype",168,35926874,"MaxQuant score",81.6320000,1.0000000,-0.0174171,,,8.7913504103199E-6,4.3446000
GYYGECGK,ox,C,363,false,"Redox kickstart of mitochondria",112,31871212,,,,-0.8120652,0.0036564,YES,,
GYYGECGK,sno,C,363,false,"hot5-4 / wildtype, FAT-switch S-nitrosoproteome",169,37277371,,,,,,,,
GGYMEVTGFTSDVR,nt,G,367,false,"Arabidopsis translation initiation landscape - NT",167b,35069635,,,,,,,,
TLEDALNSLEGVTCNR,ox,C,448,true,"Redox kickstart of mitochondria",112,31871212,,,,-1.4168968,0.0081494,YES,,
TLEDALNSLEGVTCNR,sno,C,448,true,"Site-specific nitrosomeproteomic id - gsnor1-3",90a,25699590,XCorr,3.4045279,,,,,2.4970000595204E-5,-2.7961110
TLEDALNSLEGVTCNR,sno,C,448,true,"Site-specific nitrosomeproteomic id - gsnor1-3",90b,25699590,XCorr,3.1125348,,,,,0.046879999339581,-5.1414527
LEGVTCNR,sno,C,448,false,"hot5-4 / wildtype, FAT-switch S-nitrosoproteome",169,37277371,,,,0.4347696,0.0212072,NO,,
TLEDALNSLEGVTCNR,so,C,448,true,"S-sulfenylation site detection using YAP1C",110,32714340,,,,,,,,
LEGVTCNR,so,C,448,false,"Arabidopsis S-sulfenylation chemoproteomics",108,31578252,"pFind PSM Score",0.1776430,,,,,,0.0755975
LEGVTCNR,so,C,448,false,"S-sulfenylation site detection using YAP1C",110,32714340,,,,,,,,
TAPDAFYCK,ox,C,483,true,"Redox kickstart of mitochondria",112,31871212,,,,-1.4709973,0.0010256,YES,,
TAPDAFYCKR,so,C,483,true,"S-sulfenylation site detection using YAP1C",110,32714340,,,,,,,,
TAPDAFYCK,so,C,483,true,"Arabidopsis S-sulfenylation chemoproteomics",108,31578252,"pFind PSM Score",0.0549803,,1.1081300,,,,0.5154184
CTILPQEDK,ox,C,511,false,"Redox kickstart of mitochondria",112,31871212,,,,-1.1531717,0.0041912,YES,,
CTILPQEDK,sno,C,511,false,"hot5-4 / wildtype, FAT-switch S-nitrosoproteome",169,37277371,,,,,,,,
CTILPQEDKIPAIVNR,so,C,511,true,"S-sulfenylation site detection using YAP1C",110,32714340,,,,,,,,
