Peptide,PTM,ModifiedAA,ModifiedPosition,PeptideUniqueToGene,ExperimentDesc,ExpID,PubmedID,ScoreType,IdentScore,LocProb,Log2FChange,PQ-val,QuantSig,PEP,MassErrorPPM
AEEPTTTTLVTPEKLPSPS,nt,A,2,true,"Arg/N-end rule seed, prt6 vs. Wt",99,29168982,"MASCOT Score",23.6100000,,,,,0.015320000238717,1.2909746
AEEPTTTTLVTPE,nt,A,2,true,"Arg/N-end rule seed, prt6 vs. Wt",99,29168982,"MASCOT Score",58.4100000,,0.6482874,0.4112384,NO,1.3629999557452E-5,-1.7568512
AEEPTTTTLVTPEKLPSPS,nta,A,2,true,"Arg/N-end rule seed, prt6 vs. Wt",99,29168982,"MASCOT Score",23.6100000,,0.1642996,0.3643678,NO,0.015320000238717,1.2909746
AEEPTTTTLVTPEK,nta,A,2,true,"Characterization plant N-terminal acetylation",6,22223895,"MASCOT Score",68.8400000,,,,,,
AEEPTTTTLVTPE,nta,A,2,true,"Arg/N-end rule seed, prt6 vs. Wt",99,29168982,"MASCOT Score",22.4300000,,,,,0.0058530000969768,-2.0557421
AEEPTTTTLVTPE,nta,A,2,true,"HUNTER N-terminome: legumain, GluC and trypsin",119,31951383,"MaxQuant score",141.0200000,,,,,,
LPSPSLTPSEVSESTQDALPTETETLEK,ph,S,18,true,"Lateral root-induction - NAA vs control",106,23328941,"MASCOT Score",25.0000000,,,,,,
LPSPSLTPSEVSESTQDALPTETETLEK,ph,S,20,true,"LAXIC - mannitol vs control",84b,23660473,XCorr,5.0400000,0.9660000,,,,4.3699999131494E-13,
DEASQKEVAEEKK,ph,S,90,true,"Tissue atlas Arabidopsis - ProteomicsDB",114,32188942,"MaxQuant score",149.5900000,1.0000000,,,,4.9260199830314E-7,
KSMIPQNLGSFKEESSK,ph,S,108,true,"Phosphoproteome ethylene-regulated time response",46,24043427,"MASCOT Score",61.4500000,,,,,,-6.1421000
KSMIPQNLGSFKEESSK,ph,S,108,true,"PAMP-triggered phosphorylation",48,24601666,"MASCOT Score",78.8500000,,,,,,
KSMIPQNLGSFKEESSK,ph,S,108,true,"Chloroplast kinase substrates",60,19376835,"MASCOT Score",60.1800000,,,,,,0.1678760
KSMIPQNLGSFKEESSK,ph,S,108,true,"LAXIC - ABA stress",84a,23660473,XCorr,3.2400000,0.9820000,,,,2.7399999453337E-5,
KSMIPQNLGSFKEESSK,ph,S,108,true,"SnRK2 protein kinase substrates",85,23776212,XCorr,3.5585933,1.0000000,,,,7.1948002187128E-6,
KSMIPQNLGSFKEESSK,ph,S,108,true,"atm and atr DNA damage response",88,25561503,"MASCOT Score",39.0000000,1.0000000,,,,,-2.0900000
SMIPQNLGSFKEESSK,ph,S,108,true,"Arabidopsis root NAA phosphoproteome",18a,27643528,"MaxQuant Score",184.5600000,1.0000000,,,,9.5309997383248E-28,-0.5390000
SMIPQNLGSFKEESSK,ph,S,108,true,"Phosphorylation Early Elicitor Signaling",23,17317660,,,,,,,,
SMIPQNLGSFKEESSK,ph,S,108,true,"Phosphorylation nuclei-enriched fractions",28,19245862,,,,,,,,
SMIPQNLGSFKEESSK,ph,S,108,true,"Phytohormone-responsive phosphoproteins",34,20374526,"MASCOT Score",64.0000000,,,,,,7.8917600
SMIPQNLGSFKEESSK,ph,S,108,true,"STN8 phosphoproteome",38,21768351,"MASCOT Score",65.0800000,,,,,,-0.2043690
SMIPQNLGSFKEESSK,ph,S,108,true,"Phosphoproteome iron-deficient Arabidopsis roots",41,22438062,"MASCOT Score",51.4900000,,,,,,
SMIPQNLGSFKEESSK,ph,S,108,true,"MAPK Arabidopsis substrates",45,23172892,"MaxQuant Score",105.3900000,,,,,,
SMIPQNLGSFKEESSK,ph,S,108,true,"Phosphoproteome ethylene-regulated time response",46,24043427,"MASCOT Score",78.6300000,,,,,,2.3856000
SMIPQNLGSFKEESSK,ph,S,108,true,"PAMP-triggered phosphorylation",48,24601666,"MASCOT Score",58.7700000,,,,,,
SMIPQNLGSFKEESSK,ph,S,108,true,"Tyrosine phosphorylation in Arabidopsis",59,18463617,"MASCOT Score",66.0000000,,,,,,-0.8598308
SMIPQNLGSFKEESSK,ph,S,108,true,"Chloroplast kinase substrates",60,19376835,"MASCOT Score",84.1500000,,,,,,-0.2194870
SMIPQNLGSFKEESSK,ph,S,108,true,"BSK8 and BSL2 regulating sucrose-ph synthase",66,24924143,"MaxQuant Score",126.2600000,,,,,,-0.4369200
SMIPQNLGSFKEESSK,ph,S,108,true,"srk2dei ABA signaling phopshoproteomics",83,23572148,"MASCOT Score",83.0000000,,,,,,0.0004000
SMIPQNLGSFKEESSK,ph,S,108,true,"SnRK2 protein kinase substrates",85,23776212,XCorr,3.1747136,1.0000000,,,,1.1247400344416E-8,
SMIPQNLGSFKEESSK,ph,S,108,true,"atm and atr DNA damage response",88,25561503,"MASCOT Score",56.0000000,1.0000000,,,,,0.2000000
SMIPQNLGSFKEESSK,ph,S,108,true,"Protein sumoylation and phosphorylation cross-talk",97,28419593,,,,,,,,
SMIPQNLGSFKEESSK,ph,S,108,true,"TOR Kinase and ABA Receptor",100,29290610,XCorr,3.7924261,0.9999000,,,,1.4029999874765E-5,
SMIPQNLGSFKEESSK,ph,S,108,true,"Phosphorylation tonoplast membrane fraction",107,18686298,"MASCOT Score",45.0000000,,,,,,
SMIPQNLGSFKEESSK,ph,S,108,true,"Col-0 callus - FC Col-0 vs. Col-0 Xray",111a,31410901,,66.7300000,,1.1165793,0.0000000,NO,,1.6516379
SMIPQNLGSFKEESSK,ph,S,108,true,"Col-0 X-ray callus - FC Col-0 vs. Col-0 Xray",111b,31410901,,66.7300000,,1.1165793,0.0000000,NO,,1.6516379
SMIPQNLGSFKEESSK,ph,S,108,true,"atm callus - FC atm vs. atm Xray",111c,31410901,,66.7300000,,1.6396616,0.0000000,NO,,1.6516379
SMIPQNLGSFKEESSK,ph,S,108,true,"atm-3 X-ray callus - FC atm vs. atm Xray",111d,31410901,,66.7300000,,1.6396616,0.0000000,NO,,1.6516379
SMIPQNLGSFKEESSK,ph,S,108,true,"Tissue atlas Arabidopsis - ProteomicsDB",114,32188942,"MaxQuant score",342.3000000,1.0000000,,,,0,
KSMIPQNLGSFK,ph,S,108,true,"Chloroplast kinase substrates",60,19376835,"MASCOT Score",56.8400000,,,,,,-0.7426470
KSMIPQNLGSFK,ph,S,108,true,"atm and atr DNA damage response",88,25561503,"MASCOT Score",50.0000000,1.0000000,,,,,-1.2600000
SMIPQNLGSFK,ph,S,108,true,"STN8 phosphoproteome",38,21768351,"MASCOT Score",59.1900000,,,,,,-0.5161840
SMIPQNLGSFK,ph,S,108,true,"Large-scale phosphorylation discovery",44,23111157,XCorr,3.1510000,,,,,,
SMIPQNLGSFK,ph,S,108,true,"Tyrosine phosphorylation in Arabidopsis",59,18463617,"MASCOT Score",32.0000000,,,,,,-0.5382182
SMIPQNLGSFK,ph,S,108,true,"Chloroplast kinase substrates",60,19376835,"MASCOT Score",47.3900000,,,,,,0.6541930
SMIPQNLGSFK,ph,S,108,true,"srk2dei ABA signaling phopshoproteomics",83,23572148,"MASCOT Score",59.0000000,,,,,,-0.0002000
SMIPQNLGSFK,ph,S,108,true,"LAXIC - ABA stress",84a,23660473,XCorr,2.8300000,1.0000000,,,,0.073754400014877,
SMIPQNLGSFK,ph,S,108,true,"LAXIC - mannitol vs control",84b,23660473,XCorr,2.4100000,1.0000000,,,,0.0030224600341171,
SMIPQNLGSFK,ph,S,108,true,"SnRK2 protein kinase substrates",85,23776212,XCorr,2.0361099,1.0000000,,,,0.0057349698618054,
SMIPQNLGSFK,ph,S,108,true,"atm and atr DNA damage response",88,25561503,"MASCOT Score",55.0000000,1.0000000,,,,,-0.9500000
SMIPQNLGSFK,ph,S,108,true,"TOR Kinase and ABA Receptor",100,29290610,XCorr,4.0962725,1.0000000,,,,1.4850000297884E-5,
SMIPQNLGSFK,ph,S,108,true,"Phospho cell culture sucrose/TOR",109,30833711,,,1.0000000,,,,,
SMIPQNLGSFKEESSK,ph,S,113,true,"Tyrosine phosphorylation in Arabidopsis",59,18463617,"MASCOT Score",24.0000000,,,,,,-1.7196631
SMIPQNLGSFKEESSK,ph,S,113,true,"Conserved plant phosphoproteome - Arabidopsis",61a,20466843,"MASCOT Score",66.0000000,1.0000000,,,,,
SMIPQNLGSFKEESSK,ph,S,113,true,"srk2dei ABA signaling phopshoproteomics",83,23572148,"MASCOT Score",37.0000000,,,,,,0.0022000
SMIPQNLGSFKEESSK,ph,S,114,true,"Tyrosine phosphorylation in Arabidopsis",59,18463617,"MASCOT Score",34.0000000,,,,,,-1.1822678
SMIPQNLGSFKEESSK,ph,S,114,true,"srk2dei ABA signaling phopshoproteomics",83,23572148,"MASCOT Score",45.0000000,,,,,,-0.0004000
EALDNHQFTNTPEEVK,ph,T,144,true,"Tissue atlas Arabidopsis - ProteomicsDB",114,32188942,"MaxQuant score",55.9750000,0.9692900,,,,0.0061711398884654,
EALDNHQFTNTPEEVK,ph,T,146,true,"Tissue atlas Arabidopsis - ProteomicsDB",114,32188942,"MaxQuant score",85.3970000,0.8904040,,,,0.00010233699867968,
VKDSFAMLKNTIK,ac,K,186,true,"Quantitative Acetylproteomics",101,29440448,,,,,,,,
DSFAMLKNTIK,ac,K,186,true,"Quantitative Acetylproteomics",101,29440448,,,,,,,,
ELYNKTFSDEEKR,ac,K,241,true,"Quantitative Acetylproteomics",101,29440448,,,,,,,,
ELYNKTFSDEEK,ac,K,241,true,"Quantitative Acetylproteomics",101,29440448,,,,,,,,
TFSDEEKR,ac,K,248,false,"Quantitative Acetylproteomics",101,29440448,,,,,,,,
KLDFSSGGVSTIFQVNDMK,ub,K,266,true,"upl3 mutant / wildtype",168,35926874,"MaxQuant score",128.7400000,1.0000000,1.0433445,0.4043800,NO,1.1811199533609E-13,-0.0861480
SKSKLVFAGPSR,nt,S,340,false,"Arabidopsis translation initiation landscape - NT",167b,35069635,,,,,,,,
AEFVPEEKDAYTVVIQKPR,ub,K,434,true,"upl3 mutant / wildtype",168,35926874,"MaxQuant score",116.0600000,1.0000000,0.1660727,0.6711800,NO,1.1908900515029E-12,0.7218700
AEFVPEEKDAYTVVIQKPR,ub,K,443,true,"upl3 mutant / wildtype",168,35926874,"MaxQuant score",116.0600000,1.0000000,0.1660727,0.6711800,NO,1.1908900515029E-12,0.7218700
DAYTVVIQKPR,ub,K,443,true,"upl3 mutant / wildtype",168,35926874,"MaxQuant score",123.9600000,1.0000000,-0.3291597,0.5728000,NO,1.1595499927353E-5,0.1846000
MRPSDEPVLTHSFKVNELGK,ub,K,460,true,"upl3 mutant / wildtype",168,35926874,"MaxQuant score",97.4900000,1.0000000,1.5738592,,,3.9014601327381E-8,-0.4732100
