Peptide,PTM,ModifiedAA,ModifiedPosition,PeptideUniqueToGene,ExperimentDesc,ExpID,PubmedID,ScoreType,IdentScore,LocProb,Log2FChange,PQ-val,QuantSig,PEP,MassErrorPPM
NISFPATGK,ph,S,107,true,"atm and atr DNA damage response",88,25561503,"MASCOT Score",38.0000000,1.0000000,,,,,-1.0600000
NISFPATGK,ph,S,107,true,"TOR Kinase and ABA Receptor",100,29290610,XCorr,2.2307885,0.9999000,,,,0.015690000727773,
NISFPATGK,ph,S,107,true,"Tissue atlas Arabidopsis - ProteomicsDB",114,32188942,"MaxQuant score",103.6300000,0.9999820,,,,0.000878628983628,
DEGTNSDNDDDVDGVEDVDRR,ph,S,149,true,"TOR Kinase and ABA Receptor",100,29290610,XCorr,3.3897045,0.9864000,,,,4.6349998683581E-7,
DEGTNSDNDDDVDGVEDVDR,ph,S,149,true,"atm and atr DNA damage response",88,25561503,"MASCOT Score",59.0000000,0.9970000,,,,,0.0600000
FGLVNLYGSCRR,ph,S,193,true,"Tissue atlas Arabidopsis - ProteomicsDB",114,32188942,"MaxQuant score",91.8120000,1.0000000,,,,6.3663297623862E-5,
TCAVTESIVYLPR,acy,C,198,true,"Arabidopsis S-acylation atlas - Meristem",163a,35681017,,,,,,,,
TCAVTESIVYLPR,acy,C,198,true,"Arabidopsis S-acylation atlas - Silique",163e,35681017,,,,,,,,
KAASYDNLLPR,ph,S,215,true,"atm and atr DNA damage response",88,25561503,"MASCOT Score",58.0000000,0.9530000,,,,,-0.9100000
AASYDNLLPR,ph,S,215,true,"atm and atr DNA damage response",88,25561503,"MASCOT Score",60.0000000,0.9500000,,,,,-0.2600000
AASYDNLLPR,ph,S,215,true,"Tissue atlas Arabidopsis - ProteomicsDB",114,32188942,"MaxQuant score",172.1700000,1.0000000,,,,1.3194599546296E-7,
