Peptide,PTM,ModifiedAA,ModifiedPosition,PeptideUniqueToGene,ExperimentDesc,ExpID,PubmedID,ScoreType,IdentScore,LocProb,Log2FChange,PQ-val,QuantSig,PEP,MassErrorPPM
GAYETEKPTKDAAALETQSPEDFDQPSPLR,nt,G,2,true,"HUNTER N-terminome: legumain, GluC and trypsin",119,31951383,"MaxQuant score",117.5700000,,,,,,
GAYETEKPTKDAAALETQSPED,nt,G,2,true,"HUNTER N-terminome: legumain, GluC and trypsin",119,31951383,"MaxQuant score",60.0320000,,,,,,
GAYETEKPTK,ph,T,6,true,"Tissue atlas Arabidopsis - ProteomicsDB",114,32188942,"MaxQuant score",105.3600000,0.9999550,,,,0.00013964300160296,
GAYETEKPTKDAAALETQSPEDFDQPSPLRK,ub,K,8,true,"Ubiquitination Membrane Proteins",120,33585938,,,,,,,,
GAYETEKPTKDAAALETQSPEDFDQPSPLR,ub,K,8,true,"upl3 mutant / wildtype",168,35926874,"MaxQuant score",120.2700000,0.8610000,,,,9.8435098738986E-22,-0.2775900
GAYETEKPTK,ub,K,8,true,"Ubiquitination Membrane Proteins",120,33585938,,,,,,,,
GAYETEKPTKDAAALETQSPEDFDQPSPLRK,ub,K,11,true,"Ubiquitination Membrane Proteins",120,33585938,,,,,,,,
GAYETEKPTKDAAALETQSPEDFDQPSPLR,ub,K,11,true,"Ubiquitination Membrane Proteins",120,33585938,,,,,,,,
DAAALETQSPEDFDQPSPLRK,ph,T,18,true,"TOR Kinase and ABA Receptor",100,29290610,XCorr,3.7602623,0.9026000,,,,2.7050000426243E-5,
DAAALETQSPEDFDQPSPLR,ph,T,18,true,"Tissue atlas Arabidopsis - ProteomicsDB",114,32188942,"MaxQuant score",129.1200000,0.9943460,,,,3.9071800133326E-17,
DAAALETQSPEDFDQPSPLR,ph,S,20,true,"Sucrose-induced phosphorylation",24,17586839,,,,,,,,
DAAALETQSPEDFDQPSPLR,ph,S,20,true,"TOR Kinase and ABA Receptor",100,29290610,XCorr,5.3616652,0.9941000,,,,3.8109999422886E-6,
DAAALETQSPEDFDQPSPLR,ph,S,20,true,"Tissue atlas Arabidopsis - ProteomicsDB",114,32188942,"MaxQuant score",339.5300000,1.0000000,,,,0,
DAAALETQSPEDFDQPSPLR,ph,S,20,true,"Touch-induced phosphorylation: 40s touch vs untouc",136,30291188,"MASCOT score",123.0800000,,-0.0047790,0.9759675,NO,,3.5100302
AFLADLAAGDAKR,ub,K,175,true,"Ubiquitination Membrane Proteins",120,33585938,,,,,,,,
ACDIYCANLK,acy,C,216,false,"Arabidopsis S-acylation atlas - Hypocotyl",163b,35681017,,,,,,,,
ACDIYCANLK,acy,C,220,false,"Arabidopsis S-acylation atlas - Hypocotyl",163b,35681017,,,,,,,,
ACDIYCANLK,sno,C,220,false,"hot5-4 / wildtype, FAT-switch S-nitrosoproteome",169,37277371,,,,0.0723329,0.7009572,NO,,
TAGDLAGPSASVK,ph,T,393,true,"Phosphorylation in N starvation",63,22060019,"MASCOT Score",99.0000000,,,,,,-3.6381600
ATTMGGFH,ph,T,507,true,"Tissue atlas Arabidopsis - ProteomicsDB",114,32188942,"MaxQuant score",111.8200000,0.9503450,,,,0.0097770895808935,
