Peptide,PTM,ModifiedAA,ModifiedPosition,PeptideUniqueToGene,ExperimentDesc,ExpID,PubmedID,ScoreType,IdentScore,LocProb,Log2FChange,PQ-val,QuantSig,PEP,MassErrorPPM
ELQVASDGFSNK,ph,S,303,true,"Tissue atlas Arabidopsis - ProteomicsDB",114,32188942,"MaxQuant score",97.2730000,0.9802650,,,,0.00015310000162572,
LADGTLVAVKR,ac,K,330,false,"Quantitative Acetylproteomics",101,29440448,,,,,,,,
LMDYKDTHVTTAVR,ph,Y,456,false,"Tissue atlas Arabidopsis - ProteomicsDB",114,32188942,"MaxQuant score",109.0400000,0.9434600,,,,0.00081744900671765,
LMDYKDTHVTTAVR,ph,T,459,false,"atm and atr DNA damage response",88,25561503,"MASCOT Score",23.0000000,1.0000000,,,,,-0.6100000
LMDYKDTHVTTAVR,ph,T,459,false,"Tissue atlas Arabidopsis - ProteomicsDB",114,32188942,"MaxQuant score",147.1600000,0.9997370,,,,2.0876700546069E-7,
LMDYKDTHVTTAVR,ph,T,462,false,"Plasmamembrane phosphorylation",20,15308754,,,,,,,,
LMDYKDTHVTTAVR,ph,T,462,false,"atm and atr DNA damage response",88,25561503,"MASCOT Score",23.0000000,1.0000000,,,,,-0.6100000
LMDYKDTHVTTAVR,ph,T,462,false,"Tissue atlas Arabidopsis - ProteomicsDB",114,32188942,"MaxQuant score",206.2700000,0.9999990,,,,1.7489900519074E-15,
DTHVTTAVR,ph,T,462,false,"Plasmembrane Ph Immune Responses",25,17651370,,,,,,,,
DTHVTTAVR,ph,T,462,false,"atm and atr DNA damage response",88,25561503,"MASCOT Score",50.0000000,1.0000000,,,,,-0.1700000
LMDYKDTHVTTAVR,ph,T,463,false,"Plasmamembrane phosphorylation",20,15308754,,,,,,,,
LMDYKDTHVTTAVR,ph,T,463,false,"Large-scale phosphorylation discovery",44,23111157,XCorr,4.5300000,,,,,,
LMDYKDTHVTTAVR,ph,T,463,false,"atm and atr DNA damage response",88,25561503,"MASCOT Score",23.0000000,1.0000000,,,,,-0.6100000
LMDYKDTHVTTAVR,ph,T,463,false,"Tissue atlas Arabidopsis - ProteomicsDB",114,32188942,"MaxQuant score",95.6180000,1.0000000,,,,8.3627201092895E-5,
DTHVTTAVR,ph,T,463,false,"Plasmembrane Ph Immune Responses",25,17651370,,,,,,,,
DTHVTTAVR,ph,T,463,false,"atm and atr DNA damage response",88,25561503,"MASCOT Score",50.0000000,1.0000000,,,,,-0.1700000
GTIGHIAPEYLSTGK,ph,T,468,false,"atm and atr DNA damage response",88,25561503,"MASCOT Score",35.0000000,1.0000000,,,,,-3.7500000
GTIGHIAPEYLSTGK,ph,T,468,false,"Tissue atlas Arabidopsis - ProteomicsDB",114,32188942,"MaxQuant score",65.4230000,0.9999880,,,,0.00044692700612359,
GTIGHIAPEYLSTGK,ph,S,478,false,"atm and atr DNA damage response",88,25561503,"MASCOT Score",42.0000000,0.9440000,,,,,1.4200000
GTIGHIAPEYLSTGK,ph,S,478,false,"Tissue atlas Arabidopsis - ProteomicsDB",114,32188942,"MaxQuant score",132.5100000,0.9186330,,,,8.7204202192659E-13,
LELITGQR,nt,L,496,false,"HUNTER N-terminome: legumain, GluC and trypsin",119,31951383,"MaxQuant score",78.6160000,,,,,,
