Peptide,PTM,ModifiedAA,ModifiedPosition,PeptideUniqueToGene,ExperimentDesc,ExpID,PubmedID,ScoreType,IdentScore,LocProb,Log2FChange,PQ-val,QuantSig,PEP,MassErrorPPM
MMVEDLGVEAKEAAVR,nta,M,1,true,"Arg/N-end rule pathway Roots",80,25728785,"MASCOT Score",88.2800000,,,,,2.1410000883293E-8,
MMVEDLGVEAKEAAVR,nta,M,1,true,"N-terminal ChaFRADIC",92,26010716,"MASCOT Score",34.0600000,,,,,9.5960000180639E-5,
MMVEDLGVEAKEAAVR,nta,M,1,true,"Arg/N-end rule seed, prt6 vs. Wt",99,29168982,"MASCOT Score",29.8000000,,-1.2261788,0.0123489,YES,0.021120000630617,-0.8846175
MMVEDLGVEAKEAAVR,nta,M,1,true,"Arabidopsis translation initiation landscape - NTA",167a,35069635,,,,,,,,
MMVEDLGVEAKE,nta,M,1,true,"N-terminal ChaFRADIC",92,26010716,"MASCOT Score",87.0900000,,,,,0.00071839999873191,
MMVEDLGVEAK,nta,M,1,true,"Characterization plant N-terminal acetylation",6,22223895,"MASCOT Score",65.0500000,,,,,,
LLPLPELLQSISSIK,ph,S,32,true,"Large-scale phosphorylation discovery",44,23111157,XCorr,4.4580000,,,,,,
LLPLPELLQSISSIK,ph,S,32,true,"TOR Kinase and ABA Receptor",100,29290610,XCorr,3.3130872,0.9272000,,,,2.7890000637854E-5,
LCQECQTLIDNHDQIK,so,C,88,true,"Arabidopsis S-sulfenylation chemoproteomics",108,31578252,"pFind PSM Score",0.0471407,,1.0526300,,,,0.7028492
LCQECQTLIDNHDQIK,so,C,91,true,"Arabidopsis S-sulfenylation chemoproteomics",108,31578252,"pFind PSM Score",0.0471407,,,,,,0.7028492
STTTSASSKGLAQQK,ph,S,254,true,"Tissue atlas Arabidopsis - ProteomicsDB",114,32188942,"MaxQuant score",225.8600000,0.9864940,,,,0,
CYEQIR,sno,C,274,true,"hot5-4 / wildtype, FAT-switch S-nitrosoproteome",169,37277371,,,,,,,,
DKCYEQIR,so,C,274,true,"Arabidopsis S-sulfenylation chemoproteomics",108,31578252,"pFind PSM Score",0.3125010,,0.7751900,,,,0.6009654
CLTASK,sno,C,739,true,"hot5-4 / wildtype, FAT-switch S-nitrosoproteome",169,37277371,,,,,,,,
