Peptide,PTM,ModifiedAA,ModifiedPosition,PeptideUniqueToGene,ExperimentDesc,ExpID,PubmedID,ScoreType,IdentScore,LocProb,Log2FChange,PQ-val,QuantSig,PEP,MassErrorPPM
EATEVSSSSSVSTPGR,nt,E,64,true,"Tic56 chloroplast import - wild-type",89a,25588737,XCorr,4.3126140,,,,,,
EATEVSSSSSVSTPGR,nt,E,64,true,"Tic56 chloroplast import - ppi2",89b,25588737,XCorr,3.6746244,,,,,,
EATEVSSSSSVSTPGR,nt,E,64,true,"Tic56 chloroplast import - tic56-1",89c,25588737,XCorr,3.0447857,,,,,,
EATEVSSSSSVSTPGR,nt,E,64,true,"Arg/N-end rule seed, prt6 vs. Wt",99,29168982,"MASCOT Score",90.9900000,,-0.0320058,0.8034784,NO,0.00030380001408048,-1.6872846
EATEVSSSSSVSTPGR,nt,E,64,true,"FtsH12 N-terminome: WT / FtsH12 knockdown miRNA",118,33216923,"MaxQuant score",128.6800000,,-1.0075978,0.0002007,YES,0,
EATEVSSSSSVSTPGR,nt,E,64,true,"HUNTER N-terminome: legumain, GluC and trypsin",119,31951383,"MaxQuant score",93.7660000,,,,,,
EATEVSSSSSVSTPGRN,nta,E,64,true,"HUNTER N-terminome: legumain, GluC and trypsin",119,31951383,"MaxQuant score",263.1900000,,,,,,
EATEVSSSSSVSTPGR,nta,E,64,true,"Arg/N-end rule seed, prt6 vs. Wt",99,29168982,"MASCOT Score",90.9900000,,,,,0.00030380001408048,-1.6872846
EATEVSSSSSVSTPGR,nta,E,64,true,"FtsH12 N-terminome: WT / FtsH12 knockdown miRNA",118,33216923,"MaxQuant score",46.5780000,,,,,0.023554999381304,
EATEVSSSSSVSTPGR,nta,E,64,true,"HUNTER N-terminome: legumain, GluC and trypsin",119,31951383,"MaxQuant score",300.2700000,,,,,,
ATEVSSSSSVSTPGR,nt,A,65,true,"Tic56 chloroplast import - wild-type",89a,25588737,XCorr,3.3382509,,,,,,
ATEVSSSSSVSTPGR,nt,A,65,true,"Tic56 chloroplast import - ppi2",89b,25588737,XCorr,3.9548092,,,,,,
ATEVSSSSSVSTPGR,nt,A,65,true,"Arg/N-end rule seed, prt6 vs. Wt",99,29168982,"MASCOT Score",33.9600000,,0.6084625,0.1354712,NO,0.012040000408888,-2.1526634
ATEVSSSSSVSTPGR,nt,A,65,true,"FtsH12 N-terminome: WT / FtsH12 knockdown miRNA",118,33216923,"MaxQuant score",53.3420000,,,,,0.0019209999591112,
ATEVSSSSSVSTPGRN,nta,A,65,true,"HUNTER N-terminome: legumain, GluC and trypsin",119,31951383,"MaxQuant score",136.7000000,,,,,,
ATEVSSSSSVSTPGR,nta,A,65,true,"HUNTER N-terminome: legumain, GluC and trypsin",119,31951383,"MaxQuant score",188.9600000,,,,,,
LTQDGCIVCPSTDSTFDLR,acy,C,141,true,"Arabidopsis S-acylation atlas - Silique",163e,35681017,,,,,,,,
LTQDGCIVCPSTDSTFDLR,ox,C,141,true,"SPEAR - 10 mM H2O2 / mock",138a,34619326,,,,2.0064357,0.0010097,YES,,
LTQDGCIVCPSTDSTFDLR,ox,C,141,true,"SPEAR - 50 mM H2O2 / mock",138b,34619326,,,,2.4251180,0.0148581,YES,,
KLFVYPVK,ac,K,177,true,"Histone deacetylases - hda14 vs WT (thylakoids)",98d,29061669,"MaxQuant Score",91.3000000,1.0000000,0.1370000,0.9268298,NO,0.018999999389052,
MIVDEGSEGFGFTKK,ac,K,241,true,"Histone deacetylases - hda14 vs WT (thylakoids)",98d,29061669,"MaxQuant Score",81.7000000,1.0000000,-0.7240000,0.8394600,NO,1.5199999836568E-7,
