Peptide,PTM,ModifiedAA,ModifiedPosition,PeptideUniqueToGene,ExperimentDesc,ExpID,PubmedID,ScoreType,IdentScore,LocProb,Log2FChange,PQ-val,QuantSig,PEP,MassErrorPPM
TPGESAAASQSAVPVEHRLSPVGR,ph,S,136,true,"Arabidopsis root NAA phosphoproteome",18a,27643528,"MaxQuant Score",108.0500000,0.9940000,,,,4.5910000514086E-18,0.9570000
TPGESAAASQSAVPVEHRLSPVGR,ph,S,136,true,"PAMP-triggered phosphorylation",48,24601666,"MASCOT Score",24.6400000,,,,,,
TPGESAAASQSAVPVEHRLSPVGR,ph,S,136,true,"Chloroplast kinase substrates",60,19376835,"MASCOT Score",67.5300000,,,,,,-1.3857600
TPGESAAASQSAVPVEHRLSPVGR,ph,S,136,true,"srk2dei ABA signaling phopshoproteomics",83,23572148,"MASCOT Score",44.0000000,,,,,,0.0007000
TPGESAAASQSAVPVEHRLSPVGR,ph,S,136,true,"SnRK2 protein kinase substrates",85,23776212,XCorr,3.9215140,0.9990000,,,,0.0054725999943912,
TPGESAAASQSAVPVEHRLSPVGR,ph,S,136,true,"atm and atr DNA damage response",88,25561503,"MASCOT Score",46.0000000,1.0000000,,,,,-0.7700000
TPGESAAASQSAVPVEHRLSPVGR,ph,S,136,true,"TOR Kinase and ABA Receptor",100,29290610,XCorr,5.2388587,1.0000000,,,,0.0014280000468716,
TPGESAAASQSAVPVEHRLSPVGR,ph,S,136,true,"Phospho cell culture sucrose/TOR",109,30833711,,,0.9999870,,,,,
TPGESAAASQSAVPVEHRLSPVGR,ph,S,136,true,"Tissue atlas Arabidopsis - ProteomicsDB",114,32188942,"MaxQuant score",292.9100000,1.0000000,,,,0,
AAKSPQVNR,ph,S,144,true,"SnRK2 protein kinase substrates",85,23776212,XCorr,2.0559399,1.0000000,,,,0.024546900764108,
AAKSPQVNR,ph,S,144,true,"atm and atr DNA damage response",88,25561503,"MASCOT Score",43.0000000,1.0000000,,,,,-1.5900000
IEIGKPENSAEPANTGNVPATSPVEDK,ph,S,183,true,"TOR Kinase and ABA Receptor",100,29290610,XCorr,5.8552055,0.9898000,,,,1.2210000122082E-8,
IEIGKPENSAEPANTGNVPATSPVEDK,ph,S,183,true,"Tissue atlas Arabidopsis - ProteomicsDB",114,32188942,"MaxQuant score",137.8900000,0.9250800,,,,4.6242849322719E-43,
QLSMTEEEIADVDDDSGGEGEK,ph,S,233,true,"Tissue atlas Arabidopsis - ProteomicsDB",114,32188942,"MaxQuant score",115.5400000,0.9803190,,,,2.1927299400761E-16,
QLSMTEEEIADVDDDSGGEGEK,ph,S,246,true,"Tyrosine phosphorylation in Arabidopsis",59,18463617,"MASCOT Score",47.0000000,,,,,,-0.0816681
QLSMTEEEIADVDDDSGGEGEK,ph,S,246,true,"srk2dei ABA signaling phopshoproteomics",83,23572148,"MASCOT Score",46.0000000,,,,,,-0.0019000
QLSMTEEEIADVDDDSGGEGEK,ph,S,246,true,"SnRK2 protein kinase substrates",85,23776212,XCorr,5.1730289,1.0000000,,,,9.1113699362557E-15,
QLSMTEEEIADVDDDSGGEGEK,ph,S,246,true,"Phospho cell culture sucrose/TOR",109,30833711,,,1.0000000,,,,,
QLSMTEEEIADVDDDSGGEGEK,ph,S,246,true,"Tissue atlas Arabidopsis - ProteomicsDB",114,32188942,"MaxQuant score",380.9300000,1.0000000,,,,0,
SKSVSSGSGSGGQSSSGSSSR,ub,K,293,true,"Arabidopsis ubiquitination COFRADIC",40,26744219,"MaxQuant Score",56.8820000,1.0000000,,,,1.0659999816198E-7,-0.0710000
GSGGSDDEDEVNSV,ph,S,317,true,"LAXIC - mannitol vs control",84b,23660473,XCorr,2.7000000,0.8900000,,,,5.2400000640773E-6,
GSGGSDDEDEVNSV,ph,S,317,true,"atm and atr DNA damage response",88,25561503,"MASCOT Score",37.0000000,1.0000000,,,,,-0.2900000
