Peptide,PTM,ModifiedAA,ModifiedPosition,PeptideUniqueToGene,ExperimentDesc,ExpID,PubmedID,ScoreType,IdentScore,LocProb,Log2FChange,PQ-val,QuantSig,PEP,MassErrorPPM
IFSPDQCSGINR,sno,C,39,false,"hot5-4 / wildtype, FAT-switch S-nitrosoproteome",169,37277371,,,,,,,,
MLIMEQFPETAASIVSFK,ph,S,174,true,"Phosphorylation Early Elicitor Signaling",23,17317660,,,,,,,,
MLIMEQFPETAASIVSFK,ph,S,174,true,"TOR Kinase and ABA Receptor",100,29290610,XCorr,5.2144041,1.0000000,,,,1.6800000279815E-10,
VESDVVSLDGHDFLETDAEIGDDGK,ph,S,179,true,"Tissue atlas Arabidopsis - ProteomicsDB",114,32188942,"MaxQuant score",120.1800000,0.9944500,,,,1.2470799872231E-27,
SFCGPNMTPR,ph,S,215,true,"atm and atr DNA damage response",88,25561503,"MASCOT Score",31.0000000,1.0000000,,,,,-0.3100000
SFCGPNMTPR,ph,S,215,true,"Tissue atlas Arabidopsis - ProteomicsDB",114,32188942,"MaxQuant score",144.2700000,1.0000000,,,,4.942069846688E-16,
SFCGPNMTPRPSNLTGAEIYSLSTTPR,ph,T,222,true,"TOR Kinase and ABA Receptor",100,29290610,XCorr,3.9030912,0.9741000,,,,0.00021579999884125,
SFCGPNMTPR,ph,T,222,true,"atm and atr DNA damage response",88,25561503,"MASCOT Score",31.0000000,1.0000000,,,,,0.3300000
SFCGPNMTPR,ph,T,222,true,"Tissue atlas Arabidopsis - ProteomicsDB",114,32188942,"MaxQuant score",289.2100000,1.0000000,,,,0,
SFCGPNMTPRPSNLTGAEIYSLSTTPR,ph,S,226,true,"Tissue atlas Arabidopsis - ProteomicsDB",114,32188942,"MaxQuant score",212.6400000,0.9494000,,,,0,
PSNLTGAEIYSLSTTPR,ph,S,235,true,"atm and atr DNA damage response",88,25561503,"MASCOT Score",69.0000000,0.9820000,,,,,-0.3200000
PSNLTGAEIYSLSTTPR,ph,S,235,true,"Tissue atlas Arabidopsis - ProteomicsDB",114,32188942,"MaxQuant score",417.7000000,0.9989460,,,,0,
PSNLTGAEIYSLSTTPR,ph,T,239,true,"atm and atr DNA damage response",88,25561503,"MASCOT Score",69.0000000,0.8660000,,,,,-0.3200000
PSNLTGAEIYSLSTTPR,ph,T,239,true,"Tissue atlas Arabidopsis - ProteomicsDB",114,32188942,"MaxQuant score",410.0000000,0.9421880,,,,0,
GSNFNHSDFYNMMGFPGGR,ph,S,243,true,"Tissue atlas Arabidopsis - ProteomicsDB",114,32188942,"MaxQuant score",126.8600000,0.9999770,,,,3.7947901894116E-15,
GSNFNHSDFYNMMGFPGGR,ph,S,248,true,"Tissue atlas Arabidopsis - ProteomicsDB",114,32188942,"MaxQuant score",95.9960000,0.8227900,,,,1.9081299740265E-7,
LSNFGPADMYSVQSSR,ph,S,262,false,"atm and atr DNA damage response",88,25561503,"MASCOT Score",74.0000000,1.0000000,,,,,-0.4300000
LSNFGPADMYSVQSSR,ph,S,262,false,"Tissue atlas Arabidopsis - ProteomicsDB",114,32188942,"MaxQuant score",176.9400000,1.0000000,,,,3.5894200518509E-20,
LSNFGPADMYSVQSSR,ph,S,271,false,"Tissue atlas Arabidopsis - ProteomicsDB",114,32188942,"MaxQuant score",156.4900000,0.9922910,,,,1.5519699392291E-25,
LSNFGPADMYSVQSSR,ph,S,274,false,"Phosphorylation Early Elicitor Signaling",23,17317660,,,,,,,,
LSNFGPADMYSVQSSR,ph,S,274,false,"Phytohormone-responsive phosphoproteins",34,20374526,"MASCOT Score",55.0000000,,,,,,-8.0603900
LSNFGPADMYSVQSSR,ph,S,274,false,"Tissue atlas Arabidopsis - ProteomicsDB",114,32188942,"MaxQuant score",301.7000000,0.9893810,,,,0,
LSNFGPADMYSVQSSR,ph,S,275,false,"atm and atr DNA damage response",88,25561503,"MASCOT Score",66.0000000,0.9530000,,,,,-0.2300000
GPTPRPSNFEENCAMASSPR,ph,T,279,true,"Tissue atlas Arabidopsis - ProteomicsDB",114,32188942,"MaxQuant score",157.7300000,1.0000000,,,,5.8333798750765E-28,
GPTPRPSNFEENCAMASSPR,ph,S,283,true,"Tissue atlas Arabidopsis - ProteomicsDB",114,32188942,"MaxQuant score",103.6400000,1.0000000,,,,7.6185600050849E-9,
PSNFEENCAMASSPR,ph,S,293,true,"Tissue atlas Arabidopsis - ProteomicsDB",114,32188942,"MaxQuant score",377.2100000,0.9307450,,,,0,
GPTPRPSNFEENCAMASSPR,ph,S,294,true,"TOR Kinase and ABA Receptor",100,29290610,XCorr,4.2452755,0.9926000,,,,3.237000100853E-6,
PSNFEENCAMASSPR,ph,S,294,true,"atm and atr DNA damage response",88,25561503,"MASCOT Score",91.0000000,0.9970000,,,,,-0.7400000
PSNFEENCAMASSPR,ph,S,294,true,"Tissue atlas Arabidopsis - ProteomicsDB",114,32188942,"MaxQuant score",420.4000000,0.9982200,,,,0,
FGYYPGGGAGSYPAPNPEFSSTTTSTANKSVNKNPK,ub,K,325,true,"Ubiquitination Membrane Proteins",120,33585938,,,,,,,,
SVNKNPKDVNTNQQTTLPTGGK,ub,K,329,true,"Ubiquitination Membrane Proteins",120,33585938,,,,,,,,
DVNTNQQTTLPTGGKSNSHDAK,ub,K,347,true,"Ubiquitination Membrane Proteins",120,33585938,,,,,,,,
DVNTNQQTTLPTGGKSNSHDAK,ph,S,348,true,"Tissue atlas Arabidopsis - ProteomicsDB",114,32188942,"MaxQuant score",216.8200000,0.7659720,,,,0,
ELHMFVWSSNGSPVSDR,ph,S,362,true,"Tissue atlas Arabidopsis - ProteomicsDB",114,32188942,"MaxQuant score",167.7100000,0.9921460,,,,1.5029000575214E-22,
ELHMFVWSSNGSPVSDR,ph,S,363,true,"Tissue atlas Arabidopsis - ProteomicsDB",114,32188942,"MaxQuant score",206.8000000,0.8525810,,,,0,
ELHMFVWSSNGSPVSDR,ph,S,366,true,"Chloroplast kinase substrates",60,19376835,"MASCOT Score",58.5200000,,,,,,-1.2023800
ELHMFVWSSNGSPVSDR,ph,S,366,true,"SnRK2 protein kinase substrates",85,23776212,XCorr,2.2848194,1.0000000,,,,0.011029000394046,
ELHMFVWSSNGSPVSDR,ph,S,366,true,"TOR Kinase and ABA Receptor",100,29290610,XCorr,4.9362178,1.0000000,,,,1.106000002693E-8,
ELHMFVWSSNGSPVSDR,ph,S,366,true,"Tissue atlas Arabidopsis - ProteomicsDB",114,32188942,"MaxQuant score",272.1700000,0.9998560,,,,0,
AGLNVFGGAPDNDQGGRSDQGAK,ph,S,389,true,"Phosphorylation Early Elicitor Signaling",23,17317660,,,,,,,,
AGLNVFGGAPDNDQGGRSDQGAK,ph,S,389,true,"STN8 phosphoproteome",38,21768351,"MASCOT Score",47.0200000,,,,,,-0.8568490
AGLNVFGGAPDNDQGGRSDQGAK,ph,S,389,true,"TOR Kinase and ABA Receptor",100,29290610,XCorr,3.5149641,1.0000000,,,,0.0001367999939248,
AGLNVFGGAPDNDQGGRSDQGAK,ph,S,389,true,"Tissue atlas Arabidopsis - ProteomicsDB",114,32188942,"MaxQuant score",189.1900000,1.0000000,,,,0,
MLVPDQSHNGETK,ph,S,404,true,"Tissue atlas Arabidopsis - ProteomicsDB",114,32188942,"MaxQuant score",88.7680000,0.9911350,,,,0.00012660199718084,
AVAHPASGDFGGEQQFSFAGK,ph,S,417,true,"Tissue atlas Arabidopsis - ProteomicsDB",114,32188942,"MaxQuant score",310.2500000,1.0000000,,,,0,
AVAHPASGDFGGEQQFSFAGKEEEAERPK,ph,S,427,true,"Phosphorylation Early Elicitor Signaling",23,17317660,,,,,,,,
AVAHPASGDFGGEQQFSFAGKEEEAERPK,ph,S,427,true,"Tissue atlas Arabidopsis - ProteomicsDB",114,32188942,"MaxQuant score",234.2300000,1.0000000,,,,0,
AVAHPASGDFGGEQQFSFAGK,ph,S,427,true,"TOR Kinase and ABA Receptor",100,29290610,XCorr,4.1133633,1.0000000,,,,5.6769999901007E-7,
LAPNSTAALQSK,ph,S,452,true,"Tissue atlas Arabidopsis - ProteomicsDB",114,32188942,"MaxQuant score",132.9300000,0.7818540,,,,3.1471099646296E-5,
LAPNSTAALQSK,ph,S,458,true,"Tissue atlas Arabidopsis - ProteomicsDB",114,32188942,"MaxQuant score",118.2100000,1.0000000,,,,3.4256099752383E-5,
LAPNSTAALQSKTGLGGAEASQRK,ub,K,459,true,"Ubiquitination Membrane Proteins",120,33585938,,,,,,,,
LAPNSTAALQSKTGLGGAEASQR,ub,K,459,true,"Ubiquitination Membrane Proteins",120,33585938,,,,,,,,
LAPNSTAALQSKTGLGGAEASQR,ub,K,459,true,"upl3 mutant / wildtype",168,35926874,"MaxQuant score",138.6600000,1.0000000,0.6995516,0.4421600,NO,2.3237199773105E-21,-0.0004520
TGLGGAEASQR,ph,T,460,true,"atm and atr DNA damage response",88,25561503,"MASCOT Score",40.0000000,1.0000000,,,,,0.6000000
TGLGGAEASQR,ph,T,460,true,"Tissue atlas Arabidopsis - ProteomicsDB",114,32188942,"MaxQuant score",111.1200000,1.0000000,,,,1.5662099768897E-16,
TGLGGAEASQRK,ph,S,468,true,"Tissue atlas Arabidopsis - ProteomicsDB",114,32188942,"MaxQuant score",94.0170000,1.0000000,,,,4.3475600250531E-5,
