Peptide,PTM,ModifiedAA,ModifiedPosition,PeptideUniqueToGene,ExperimentDesc,ExpID,PubmedID,ScoreType,IdentScore,LocProb,Log2FChange,PQ-val,QuantSig,PEP,MassErrorPPM
AKTEAPSLVGKLETE,nt,A,2,true,"N-terminal ChaFRADIC",92,26010716,"MASCOT Score",38.0700000,,,,,0.0024679999332875,
AKTEAPSLVGKLETEVEIKASAGQF,nta,A,2,true,"Arg/N-end rule pathway Roots",80,25728785,"MASCOT Score",53.0200000,,,,,3.3199999052158E-6,
AKTEAPSLVGKLETEVEIK,nta,A,2,true,"Arg/N-end rule pathway Roots",80,25728785,"MASCOT Score",31.3400000,,,,,0.00031380000291392,
AKTEAPSLVGKLETE,nta,A,2,true,"N-terminal ChaFRADIC",92,26010716,"MASCOT Score",38.0700000,,,,,0.0024679999332875,
AKTEAPSLVGK,nta,A,2,true,"Arg/N-end rule pathway Roots",80,25728785,"MASCOT Score",35.1300000,,,,,0.051109999418259,
AKTEAPSLVGK,ac,K,3,true,"Quantitative Acetylproteomics",101,29440448,,,,,,,,
AKTEAPSLVGK,ph,T,4,true,"Tissue atlas Arabidopsis - ProteomicsDB",114,32188942,"MaxQuant score",72.8150000,0.9999400,,,,0.0011146599426866,
SCDLHEGDWGTVG,nt,S,47,true,"N-terminal ChaFRADIC",92,26010716,"MASCOT Score",29.1600000,,,,,0.018430000171065,
TLLQFCVE,nt,T,140,false,"Arg/N-end rule seed, prt6 vs. Wt",99,29168982,"MASCOT Score",38.2800000,,-0.3120179,0.2556194,NO,0.0029140000697225,0.4454657
SCDLHEGDWGTVG,nt,S,203,true,"N-terminal ChaFRADIC",92,26010716,"MASCOT Score",29.1600000,,,,,0.018430000171065,
TLLQFAVE,nt,T,296,true,"N-terminal ChaFRADIC",92,26010716,"MASCOT Score",54.2600000,,,,,0.012459999881685,
