Peptide,PTM,ModifiedAA,ModifiedPosition,PeptideUniqueToGene,ExperimentDesc,ExpID,PubmedID,ScoreType,IdentScore,LocProb,Log2FChange,PQ-val,QuantSig,PEP,MassErrorPPM
SNVTKFDEVTNSLDEDMDQIRR,nt,S,51,true,"Stromal N-terminome",96,26371235,"MASCOT Score",52.1900000,,,,,,
SNVTKFDEVTNSLDEDMDQIR,nt,S,51,true,"Stromal N-terminome",96,26371235,"MASCOT Score",30.0600000,,,,,,
SNVTKFDEVTNSLDEDMDQIR,nt,S,51,true,"HUNTER N-terminome: legumain, GluC and trypsin",119,31951383,"MaxQuant score",114.6300000,,,,,,
SNVTKFDEVTNSLDEDMDQIRR,nta,S,51,true,"Stromal N-terminome",96,26371235,"MASCOT Score",52.1900000,,,,,,
SNVTKFDEVTNSLDEDMDQIR,nta,S,51,true,"Stromal N-terminome",96,26371235,"MASCOT Score",30.0600000,,,,,,
SNVTKFDEVTNSLDEDMDQIR,nta,S,51,true,"HUNTER N-terminome: legumain, GluC and trypsin",119,31951383,"MaxQuant score",142.2300000,,,,,,
VTKFDEVTNSLDEDMDQIRR,nt,V,53,true,"Stromal N-terminome",96,26371235,"MASCOT Score",37.6800000,,,,,,
VTKFDEVTNSLDEDMDQIR,nt,V,53,true,"HUNTER N-terminome: legumain, GluC and trypsin",119,31951383,"MaxQuant score",76.7040000,,,,,,
ICDLAAR,ox,C,209,true,"SPEAR - 10 mM H2O2 / mock",138a,34619326,,,,-2.7798420,0.0163223,YES,,
ICDLAAR,ox,C,209,true,"SPEAR - 50 mM H2O2 / mock",138b,34619326,,,,-1.8485232,0.0063567,YES,,
QTKVSTLIR,ac,K,222,true,"Quantitative Acetylproteomics",101,29440448,,,,,,,,
NVIDKGVELNK,ac,K,407,true,"Histone deacetylases - apicidin vs control",98a,29061669,"MaxQuant Score",79.5000000,1.0000000,-0.1750000,0.3715352,NO,0.00049000000581145,
NVIDKGVELNK,ac,K,407,true,"Histone deacetylases substrates - hda14 vs WT",98e,29061669,"MaxQuant Score",63.1000000,1.0000000,0.7780000,0.0748170,NO,0.0010000000474975,
