Peptide,PTM,ModifiedAA,ModifiedPosition,PeptideUniqueToGene,ExperimentDesc,ExpID,PubmedID,ScoreType,IdentScore,LocProb,Log2FChange,PQ-val,QuantSig,PEP,MassErrorPPM
MDPIESVEYNGFETSNGNVDHGWKKVVYPKR,nta,M,1,true,"HUNTER N-terminome: legumain, GluC and trypsin",119,31951383,"MaxQuant score",51.2360000,,,,,,
MDPIESVEYN,nta,M,1,false,"HUNTER N-terminome: legumain, GluC and trypsin",119,31951383,"MaxQuant score",101.2500000,,,,,,
TVASNGTVANGGDNVFR,ph,T,48,true,"Tissue atlas Arabidopsis - ProteomicsDB",114,32188942,"MaxQuant score",154.5100000,0.9987160,,,,1.712469935219E-16,
TVASNGTVANGGDNVFR,ph,S,51,true,"Tissue atlas Arabidopsis - ProteomicsDB",114,32188942,"MaxQuant score",167.2900000,0.9998600,,,,5.2558997556586E-22,
TVASNGTVANGGDNVFR,ng,N,52,true,"Conserved N-glycosylation",74,22633491,"MaxQuant Score",198.2000000,1.0000000,,,,0,0.3840000
TVASNGTVANGGDNVFR,ph,T,54,true,"Tissue atlas Arabidopsis - ProteomicsDB",114,32188942,"MaxQuant score",234.8200000,0.9999980,,,,0,
SLEEQAEDRR,ph,S,65,true,"Tissue atlas Arabidopsis - ProteomicsDB",114,32188942,"MaxQuant score",150.0900000,1.0000000,,,,0.00016625100397505,
MTAIDSDDDGVVR,ph,T,83,true,"Tissue atlas Arabidopsis - ProteomicsDB",114,32188942,"MaxQuant score",138.1900000,1.0000000,,,,5.2362200221978E-5,
ILAAKMTAIDSDDDGVVR,ph,S,87,true,"MAPK Arabidopsis substrates",45,23172892,"MaxQuant Score",125.5100000,,,,,,
ILAAKMTAIDSDDDGVVR,ph,S,87,true,"Chloroplast kinase substrates",60,19376835,"MASCOT Score",53.0200000,,,,,,-0.7524950
MTAIDSDDDGVVRSK,ph,S,87,true,"Chloroplast kinase substrates",60,19376835,"MASCOT Score",46.5300000,,,,,,-0.9046040
MTAIDSDDDGVVRSK,ph,S,87,true,"atm and atr DNA damage response",88,25561503,"MASCOT Score",48.0000000,1.0000000,,,,,1.1400000
MTAIDSDDDGVVRSK,ph,S,87,true,"Brassinosteroid-Regulated Phosphorylation Dynamics",94,26187819,"MaxQuant Score",201.1800000,1.0000000,,,,0,2.7030000
MTAIDSDDDGVVRSK,ph,S,87,true,"TOR Kinase and ABA Receptor",100,29290610,XCorr,5.3918338,0.9772000,,,,9.5689995305293E-7,
MTAIDSDDDGVVRSK,ph,S,87,true,"Tissue atlas Arabidopsis - ProteomicsDB",114,32188942,"MaxQuant score",291.2100000,1.0000000,,,,0,
MTAIDSDDDGVVR,ph,S,87,true,"Arabidopsis root NAA phosphoproteome",18a,27643528,"MaxQuant Score",105.3900000,1.0000000,,,,6.1319997690656E-11,-0.2770000
MTAIDSDDDGVVR,ph,S,87,true,"Plasmamembrane phosphorylation",20,15308754,,,,,,,,
MTAIDSDDDGVVR,ph,S,87,true,"Phosphorylation Early Elicitor Signaling",23,17317660,,,,,,,,
MTAIDSDDDGVVR,ph,S,87,true,"Phosphorylation nuclei-enriched fractions",28,19245862,,,,,,,,
MTAIDSDDDGVVR,ph,S,87,true,"Ethylene-regulated phosphorylation ein2 mutant",30,19253305,"MASCOT Score",54.6667000,,,,,,-1.4921144
MTAIDSDDDGVVR,ph,S,87,true,"Phytohormone-responsive phosphoproteins",34,20374526,"MASCOT Score",85.0000000,,,,,,-0.0043282
MTAIDSDDDGVVR,ph,S,87,true,"STN8 phosphoproteome",38,21768351,"MASCOT Score",100.8900000,,,,,,-0.4112180
MTAIDSDDDGVVR,ph,S,87,true,"Phosphoproteomic analysis of seed maturation",42,22440515,"MASCOT Score",79.0000000,,,,,,-0.4000000
MTAIDSDDDGVVR,ph,S,87,true,"Pollen phosphoproteome Arabidopsis",43,22631563,"MASCOT Score",99.5900000,,,,,,-1.1707500
MTAIDSDDDGVVR,ph,S,87,true,"Large-scale phosphorylation discovery",44,23111157,XCorr,5.5730000,,,,,,
MTAIDSDDDGVVR,ph,S,87,true,"Phosphoproteome ethylene-regulated time response",46,24043427,"MASCOT Score",99.6900000,,,,,,-3.5594000
MTAIDSDDDGVVR,ph,S,87,true,"Tyrosine phosphorylation in Arabidopsis",59,18463617,"MASCOT Score",76.0000000,,,,,,-0.8061379
MTAIDSDDDGVVR,ph,S,87,true,"Chloroplast kinase substrates",60,19376835,"MASCOT Score",96.5200000,,,,,,-1.0486800
MTAIDSDDDGVVR,ph,S,87,true,"BSK8 and BSL2 regulating sucrose-ph synthase",66,24924143,"MaxQuant Score",174.5900000,,,,,,-0.4084500
MTAIDSDDDGVVR,ph,S,87,true,"srk2dei ABA signaling phopshoproteomics",83,23572148,"MASCOT Score",95.0000000,,,,,,-0.0002000
MTAIDSDDDGVVR,ph,S,87,true,"LAXIC - ABA stress",84a,23660473,XCorr,5.4900000,1.0000000,,,,4.4299999899522E-6,
MTAIDSDDDGVVR,ph,S,87,true,"LAXIC - mannitol vs control",84b,23660473,XCorr,5.1100000,1.0000000,,,,0.0018117999425158,
MTAIDSDDDGVVR,ph,S,87,true,"SnRK2 protein kinase substrates",85,23776212,XCorr,4.3823781,1.0000000,,,,1.3008099805645E-11,
MTAIDSDDDGVVR,ph,S,87,true,"SIRK1 phosphorylation",86a,23820729,"MaxQuant Score",251.0000000,1.0000000,,,,1.5099999752734E-24,8.3120000
MTAIDSDDDGVVR,ph,S,87,true,"SIRK1 exp - sirk1 mutant vs WT",86b,23820729,,,,-0.5437730,,NO,,
MTAIDSDDDGVVR,ph,S,87,true,"SIRK1 exp - 35S:SIRK1 vs WT",86c,23820729,,,,0.5868729,,NO,,
MTAIDSDDDGVVR,ph,S,87,true,"atm and atr DNA damage response",88,25561503,"MASCOT Score",82.0000000,0.9960000,,,,,0.2300000
MTAIDSDDDGVVR,ph,S,87,true,"Protein sumoylation and phosphorylation cross-talk",97,28419593,,,,,,,,
MTAIDSDDDGVVR,ph,S,87,true,"TOR Kinase and ABA Receptor",100,29290610,XCorr,5.1451640,1.0000000,,,,1.0360000146648E-7,
MTAIDSDDDGVVR,ph,S,87,true,"Lateral root-induction - NAA vs control",106,23328941,"MASCOT Score",56.0000000,,,,,,
MTAIDSDDDGVVR,ph,S,87,true,"Phosphorylation tonoplast membrane fraction",107,18686298,"MASCOT Score",60.0000000,,,,,,
MTAIDSDDDGVVR,ph,S,87,true,"Phospho cell culture sucrose/TOR",109,30833711,,,1.0000000,,,,,
MTAIDSDDDGVVR,ph,S,87,true,"Col-0 callus - FC Col-0 vs. Col-0 Xray",111a,31410901,,85.3100000,,0.0072460,0.0000000,NO,,0.9254270
MTAIDSDDDGVVR,ph,S,87,true,"Col-0 X-ray callus - FC Col-0 vs. Col-0 Xray",111b,31410901,,85.3100000,,0.0072460,0.0000000,NO,,0.9254270
MTAIDSDDDGVVR,ph,S,87,true,"atm callus - FC atm vs. atm Xray",111c,31410901,,85.3100000,,-0.2126323,0.0000000,NO,,0.9254270
MTAIDSDDDGVVR,ph,S,87,true,"atm-3 X-ray callus - FC atm vs. atm Xray",111d,31410901,,85.3100000,,-0.2126323,0.0000000,NO,,0.9254270
MTAIDSDDDGVVR,ph,S,87,true,"Touch-induced phosphorylation: 40s touch vs untouc",136,30291188,"MASCOT score",100.8200000,,0.0083099,0.9769234,NO,,0.0585042
MTAIDSDDDGVVRSK,ph,S,95,true,"atm and atr DNA damage response",88,25561503,"MASCOT Score",48.0000000,1.0000000,,,,,1.1400000
MTAIDSDDDGVVRSK,ph,S,95,true,"TOR Kinase and ABA Receptor",100,29290610,XCorr,5.3918338,1.0000000,,,,9.5689995305293E-7,
MTAIDSDDDGVVRSK,ph,S,95,true,"Tissue atlas Arabidopsis - ProteomicsDB",114,32188942,"MaxQuant score",291.2100000,1.0000000,,,,0,
HRSNGYGDDGYDFDGSDDEIATLK,ph,S,112,true,"STN8 phosphoproteome",38,21768351,"MASCOT Score",103.6500000,,,,,,-1.6268800
HRSNGYGDDGYDFDGSDDEIATLK,ph,S,112,true,"Chloroplast kinase substrates",60,19376835,"MASCOT Score",80.0300000,,,,,,-1.2201500
HRSNGYGDDGYDFDGSDDEIATLK,ph,S,112,true,"Brassinosteroid-Regulated Phosphorylation Dynamics",94,26187819,"MaxQuant Score",165.3000000,1.0000000,,,,6.6919999298045E-18,-1.2480000
HRSNGYGDDGYDFDGSDDEIATLK,ph,S,112,true,"TOR Kinase and ABA Receptor",100,29290610,XCorr,6.2790880,0.9998000,,,,2.7659999091156E-7,
SNGYGDDGYDFDGSDDEIATLK,ph,S,112,true,"Arabidopsis root NAA phosphoproteome",18a,27643528,"MaxQuant Score",122.4700000,1.0000000,,,,8.183999869532E-19,0.5160000
SNGYGDDGYDFDGSDDEIATLK,ph,S,112,true,"Phosphorylation nuclei-enriched fractions",28,19245862,,,,,,,,
SNGYGDDGYDFDGSDDEIATLK,ph,S,112,true,"Mitochondrial phosphoproteome",32,19688752,"MASCOT Score",31.5500000,,,,,,8.8300700
SNGYGDDGYDFDGSDDEIATLK,ph,S,112,true,"Phytohormone-responsive phosphoproteins",34,20374526,"MASCOT Score",55.0000000,,,,,,-3.4906000
SNGYGDDGYDFDGSDDEIATLK,ph,S,112,true,"STN8 phosphoproteome",38,21768351,"MASCOT Score",105.5500000,,,,,,-2.1764000
SNGYGDDGYDFDGSDDEIATLK,ph,S,112,true,"Large-scale phosphorylation discovery",44,23111157,XCorr,5.1300000,,,,,,
SNGYGDDGYDFDGSDDEIATLK,ph,S,112,true,"Chloroplast kinase substrates",60,19376835,"MASCOT Score",97.0500000,,,,,,-1.6014300
SNGYGDDGYDFDGSDDEIATLK,ph,S,112,true,"BSK8 and BSL2 regulating sucrose-ph synthase",66,24924143,"MaxQuant Score",218.1900000,,,,,,0.1713000
SNGYGDDGYDFDGSDDEIATLK,ph,S,112,true,"srk2dei ABA signaling phopshoproteomics",83,23572148,"MASCOT Score",96.0000000,,,,,,-0.0034000
SNGYGDDGYDFDGSDDEIATLK,ph,S,112,true,"LAXIC - ABA stress",84a,23660473,XCorr,5.4300000,1.0000000,,,,9.5999996574392E-7,
SNGYGDDGYDFDGSDDEIATLK,ph,S,112,true,"LAXIC - mannitol vs control",84b,23660473,XCorr,5.7000000,1.0000000,,,,6.5700000439497E-15,
SNGYGDDGYDFDGSDDEIATLK,ph,S,112,true,"SnRK2 protein kinase substrates",85,23776212,XCorr,5.2808852,1.0000000,,,,3.1560498658934E-10,
SNGYGDDGYDFDGSDDEIATLK,ph,S,112,true,"SIRK1 phosphorylation",86a,23820729,"MaxQuant Score",166.3100000,0.9990000,,,,8.969999726105E-6,7.9890000
SNGYGDDGYDFDGSDDEIATLK,ph,S,112,true,"atm and atr DNA damage response",88,25561503,"MASCOT Score",35.0000000,1.0000000,,,,,-0.4700000
SNGYGDDGYDFDGSDDEIATLK,ph,S,112,true,"TOR Kinase and ABA Receptor",100,29290610,XCorr,6.2179384,0.9999000,,,,1.8139999724553E-7,
SNGYGDDGYDFDGSDDEIATLK,ph,S,112,true,"Lateral root-induction - NAA vs control",106,23328941,"MASCOT Score",80.0000000,,-0.1696985,0.3805703,NO,,
SNGYGDDGYDFDGSDDEIATLK,ph,S,112,true,"Phospho cell culture sucrose/TOR",109,30833711,,,0.9999970,,,,,
SNGYGDDGYDFDGSDDEIATLK,ph,S,112,true,"Col-0 callus - FC Col-0 vs. Col-0 Xray",111a,31410901,,98.8200000,,-0.4033025,0.0000000,NO,,1.0646323
SNGYGDDGYDFDGSDDEIATLK,ph,S,112,true,"Col-0 X-ray callus - FC Col-0 vs. Col-0 Xray",111b,31410901,,98.8200000,,-0.4033025,0.0000000,NO,,1.0646323
SNGYGDDGYDFDGSDDEIATLK,ph,S,112,true,"atm callus - FC atm vs. atm Xray",111c,31410901,,98.8200000,,-0.1649364,0.0000000,NO,,1.0646323
SNGYGDDGYDFDGSDDEIATLK,ph,S,112,true,"atm-3 X-ray callus - FC atm vs. atm Xray",111d,31410901,,98.8200000,,-0.1649364,0.0000000,NO,,1.0646323
SNGYGDDGYDFDGSDDEIATLK,ph,S,112,true,"Tissue atlas Arabidopsis - ProteomicsDB",114,32188942,"MaxQuant score",513.2600000,1.0000000,,,,0,
NCNPQSR,sno,C,340,true,"hot5-4 / wildtype, FAT-switch S-nitrosoproteome",169,37277371,,,,,,,,
VKATERFEAIYPLLK,ub,K,398,false,"Ubiquitination Membrane Proteins",120,33585938,,,,,,,,
LKNEEVITEGGANASLYK,ac,K,517,true,"Quantitative Acetylproteomics",101,29440448,,,,,,,,
GSGCLK,sno,C,552,false,"hot5-4 / wildtype, FAT-switch S-nitrosoproteome",169,37277371,,,,0.2123839,0.0790628,NO,,
