Peptide,PTM,ModifiedAA,ModifiedPosition,PeptideUniqueToGene,ExperimentDesc,ExpID,PubmedID,ScoreType,IdentScore,LocProb,Log2FChange,PQ-val,QuantSig,PEP,MassErrorPPM
FEERESMDDDVLYK,ph,S,418,true,"Brassinosteroid-Regulated Phosphorylation Dynamics",94,26187819,"MaxQuant Score",78.7630000,1.0000000,,,,0.048000000417233,-1.9440000
FEERESMDDDVLYK,ph,Y,425,true,"Brassinosteroid-Regulated Phosphorylation Dynamics",94,26187819,"MaxQuant Score",78.7630000,1.0000000,,,,0.048000000417233,-1.9440000
SFSPSNSSDEEEEDEMDAAR,ph,S,444,true,"SnRK2 protein kinase substrates",85,23776212,XCorr,3.8426886,0.9530000,,,,0.00069608801277354,
NSKSGLEDYSQMPGSTRK,ph,Y,607,true,"srk2dei ABA signaling phopshoproteomics",83,23572148,"MASCOT Score",24.0000000,,,,,,0.0010000
NSKSGLEDYSQMPGSTRK,ph,S,608,true,"srk2dei ABA signaling phopshoproteomics",83,23572148,"MASCOT Score",24.0000000,,,,,,0.0010000
ISDVSASSGLDDDTSGSRK,ph,S,631,true,"Tissue atlas Arabidopsis - ProteomicsDB",114,32188942,"MaxQuant score",109.2300000,0.7750380,,,,9.2343903357328E-11,
ISDVSASSGLDDDTSGSR,ph,S,632,true,"Tissue atlas Arabidopsis - ProteomicsDB",114,32188942,"MaxQuant score",88.4860000,0.8801580,,,,1.4928100426914E-5,
EHPDRTDSDKDAILDEPHVK,ph,T,649,true,"Phospho cell culture sucrose/TOR",109,30833711,,,0.7703110,,,,,
TDSDKDAILDEPHVK,ph,S,651,true,"Tissue atlas Arabidopsis - ProteomicsDB",114,32188942,"MaxQuant score",130.4700000,0.9995310,,,,5.368709886657E-17,
DLSDEVSTDR,ph,S,686,true,"atm and atr DNA damage response",88,25561503,"MASCOT Score",33.0000000,1.0000000,,,,,0.1500000
DLSDEVSTDR,ph,S,686,true,"Tissue atlas Arabidopsis - ProteomicsDB",114,32188942,"MaxQuant score",171.6700000,1.0000000,,,,5.2369400691532E-6,
DLSDEVSTDR,ph,S,690,true,"Tissue atlas Arabidopsis - ProteomicsDB",114,32188942,"MaxQuant score",136.7000000,0.8591000,,,,1.3701799616683E-5,
RRSVSPSPVR,ph,S,809,true,"atm and atr DNA damage response",88,25561503,"MASCOT Score",30.0000000,1.0000000,,,,,-1.2700000
RRSVSPSPVR,ph,S,809,true,"TOR Kinase and ABA Receptor",100,29290610,XCorr,2.1107388,1.0000000,,,,0.0048279999755323,
RSVSPSPVR,ph,S,809,true,"atm and atr DNA damage response",88,25561503,"MASCOT Score",22.0000000,1.0000000,,,,,-0.7200000
SVSPSPVR,ph,S,809,true,"atm and atr DNA damage response",88,25561503,"MASCOT Score",30.0000000,1.0000000,,,,,-0.1500000
SVSPSPVR,ph,S,809,true,"Phospho cell culture sucrose/TOR",109,30833711,,,1.0000000,,,,,
SVSPSPVR,ph,S,809,true,"Tissue atlas Arabidopsis - ProteomicsDB",114,32188942,"MaxQuant score",83.3580000,0.9999980,,,,0.0065297298133373,
RRSVSPSPVR,ph,S,811,true,"Conserved plant phosphoproteome - Arabidopsis",61a,20466843,"MASCOT Score",22.0000000,1.0000000,,,,,
RRSVSPSPVR,ph,S,811,true,"atm and atr DNA damage response",88,25561503,"MASCOT Score",30.0000000,1.0000000,,,,,-1.2700000
RRSVSPSPVR,ph,S,811,true,"TOR Kinase and ABA Receptor",100,29290610,XCorr,2.1107388,0.9987000,,,,0.0048279999755323,
RRSVSPSPVR,ph,S,811,true,"Phospho cell culture sucrose/TOR",109,30833711,,,1.0000000,,,,,
RSVSPSPVR,ph,S,811,true,"atm and atr DNA damage response",88,25561503,"MASCOT Score",22.0000000,1.0000000,,,,,-0.7200000
SVSPSPVR,ph,S,811,true,"atm and atr DNA damage response",88,25561503,"MASCOT Score",30.0000000,0.9940000,,,,,-0.1500000
SVSPSPVR,ph,S,811,true,"Tissue atlas Arabidopsis - ProteomicsDB",114,32188942,"MaxQuant score",83.3580000,0.9995060,,,,0.0065297298133373,
RRSVSPSPVR,ph,S,813,true,"atm and atr DNA damage response",88,25561503,"MASCOT Score",30.0000000,1.0000000,,,,,-1.2700000
RSVSPSPVR,ph,S,813,true,"atm and atr DNA damage response",88,25561503,"MASCOT Score",22.0000000,1.0000000,,,,,-0.7200000
RSSPSSDESSDDSK,ph,S,833,true,"Large-scale phosphorylation discovery",44,23111157,XCorr,2.4540000,,,,,,
HVSSRSPHSK,ph,S,858,true,"atm and atr DNA damage response",88,25561503,"MASCOT Score",27.0000000,0.9320000,,,,,0.2900000
HVSSRSPHSK,ph,S,863,true,"atm and atr DNA damage response",88,25561503,"MASCOT Score",27.0000000,0.9360000,,,,,0.2900000
HSQHKNTLYSSHDK,ph,S,875,true,"Tyrosine phosphorylation in Arabidopsis",59,18463617,"MASCOT Score",22.0000000,,,,,,-1.4198409
