Peptide,PTM,ModifiedAA,ModifiedPosition,PeptideUniqueToGene,ExperimentDesc,ExpID,PubmedID,ScoreType,IdentScore,LocProb,Log2FChange,PQ-val,QuantSig,PEP,MassErrorPPM
VTCSPLLEHNETAYVPNFVATMEK,ng,N,47,true,"Conserved N-glycosylation",74,22633491,"MaxQuant Score",134.2700000,1.0000000,,,,6.9550000594901E-25,-0.2310000
TMLPQCYPQNGGR,ox,C,112,true,"OxiTRAQ Arabidopsis - 5 mM H2O2 versus control",47,24376095,,,,-0.1550547,0.1662115,NO,,
AENYSFYNEYKGPEDSIVCGNTTRK,ng,N,131,true,"Conserved N-glycosylation",74,22633491,"MaxQuant Score",208.8200000,1.0000000,,,,0,0.0030000
AENYSFYNEYKGPEDSIVCGNTTRK,ng,N,149,true,"Conserved N-glycosylation",74,22633491,"MaxQuant Score",208.8200000,1.0000000,,,,0,0.0030000
GPEDSIVCGNTTR,ng,N,149,true,"Conserved N-glycosylation",74,22633491,"MaxQuant Score",208.8200000,1.0000000,,,,0,2.5130000
AGESESESAFVLANCWR,acy,C,199,true,"Arabidopsis S-acylation atlas - Meristem",163a,35681017,,,,,,,,
AGESESESAFVLANCWR,acy,C,199,true,"Arabidopsis S-acylation atlas - Hypocotyl",163b,35681017,,,,,,,,
TLSPDSCK,sno,C,208,true,"hot5-4 / wildtype, FAT-switch S-nitrosoproteome",169,37277371,,,,0.5409152,0.0762464,NO,,
QCLENASASVVK,sno,C,211,true,"hot5-4 / wildtype, FAT-switch S-nitrosoproteome",169,37277371,,,,,,,,
QCLENASASVVK,ng,N,214,true,"Conserved N-glycosylation",74,22633491,"MaxQuant Score",132.2700000,1.0000000,,,,5.3219997853127E-12,-0.1600000
GCLPWSEGR,acy,C,223,true,"Arabidopsis S-acylation atlas - Meristem",163a,35681017,,,,,,,,
TLKDSSLNFK,ph,S,309,true,"atm and atr DNA damage response",88,25561503,"MASCOT Score",31.0000000,0.9360000,,,,,-3.1600000
TLKDSSLNFK,ph,S,309,true,"Tissue atlas Arabidopsis - ProteomicsDB",114,32188942,"MaxQuant score",96.5510000,0.8996480,,,,0.00098344497382641,
TLKDSSLNFK,ph,S,310,true,"atm and atr DNA damage response",88,25561503,"MASCOT Score",30.0000000,0.9950000,,,,,-1.8400000
DSSLNFK,ph,S,310,true,"Tissue atlas Arabidopsis - ProteomicsDB",114,32188942,"MaxQuant score",146.5000000,0.9994030,,,,1.3367199471759E-6,
