Peptide,PTM,ModifiedAA,ModifiedPosition,PeptideUniqueToGene,ExperimentDesc,ExpID,PubmedID,ScoreType,IdentScore,LocProb,Log2FChange,PQ-val,QuantSig,PEP,MassErrorPPM
ATESYEAAIKGLN,nta,A,2,true,"HUNTER N-terminome: legumain, GluC and trypsin",119,31951383,"MaxQuant score",117.3000000,,,,,,
ATESYEAAIK,nta,A,2,true,"Characterization plant N-terminal acetylation",6,22223895,"MASCOT Score",66.3500000,,,,,,
GLNDLLSTKADLGNVAAAK,ac,K,20,true,"Quantitative Acetylproteomics",101,29440448,,,,,,,,
GLNDLLSTKADLGNVAAAK,ub,K,20,true,"Ubiquitination Membrane Proteins",120,33585938,,,,,,,,
GLNDLLSTKADLGNVAAAK,ub,K,20,true,"upl3 mutant / wildtype",168,35926874,"MaxQuant score",192.2400000,1.0000000,0.1401242,0.7364400,NO,3.0224099306978E-38,-0.3615200
ADLGNVAAAKIK,ub,K,30,true,"Ubiquitination Membrane Proteins",120,33585938,,,,,,,,
ADLGNVAAAKIK,ub,K,30,true,"upl3 mutant / wildtype",168,35926874,"MaxQuant score",84.6050000,1.0000000,1.0888200,0.3293000,NO,0.0005369299906306,1.2070000
IKALTAELKELDSSNSDAIER,ub,K,32,true,"Ubiquitination Membrane Proteins",120,33585938,,,,,,,,
IKALTAELK,ub,K,32,true,"Ubiquitination Membrane Proteins",120,33585938,,,,,,,,
IKALTAELK,ub,K,32,true,"upl3 mutant / wildtype",168,35926874,"MaxQuant score",101.6500000,1.0000000,0.0200577,0.9748600,NO,0.0006753759807907,2.1044000
ALTAELKELDSSNSDAIER,ub,K,39,true,"Ubiquitination Membrane Proteins",120,33585938,,,,,,,,
ALTAELKELDSSNSDAIER,ub,K,39,true,"upl3 mutant / wildtype",168,35926874,"MaxQuant score",207.5300000,1.0000000,-0.0276750,0.9382800,NO,2.1019476964872E-44,-0.2205400
ELDSSNSDAIER,nt,E,40,true,"Metacaspase9 substrates - in vitro rMC9",51c,23964026,"MASCOT Score",77.0000000,,1.7570351,,NO,,-0.2135783
ELDSSNSDAIER,ph,S,43,true,"SIRK1 phosphorylation",86a,23820729,"MaxQuant Score",40.6090000,0.8020000,,,,1.2170000076294,3.5860000
ELDSSNSDAIER,ph,S,43,true,"SIRK1 exp - sirk1 mutant vs WT",86b,23820729,,,,-1.3730720,,NO,,
ELDSSNSDAIER,ph,S,43,true,"SIRK1 exp - 35S:SIRK1 vs WT",86c,23820729,,,,0.0222866,,NO,,
ELDSSNSDAIER,ph,S,44,true,"Tissue atlas Arabidopsis - ProteomicsDB",114,32188942,"MaxQuant score",93.3480000,0.8722740,,,,0.00025261100381613,
ELDSSNSDAIER,ph,S,46,true,"TOR Kinase and ABA Receptor",100,29290610,XCorr,3.4187665,0.9999000,,,,0.00020039999799337,
ELDSSNSDAIER,ph,S,46,true,"Tissue atlas Arabidopsis - ProteomicsDB",114,32188942,"MaxQuant score",178.2200000,0.9999460,,,,1.4040399573822E-19,
IKTGFTQFK,ac,K,53,true,"Quantitative Acetylproteomics",101,29440448,,,,,,,,
IKTGFTQFK,ub,K,53,true,"upl3 mutant / wildtype",168,35926874,"MaxQuant score",76.1700000,1.0000000,-0.3695945,0.2869400,NO,0.0029262600000948,-0.4546800
TGFTQFKTEK,ac,K,60,true,"Quantitative Acetylproteomics",101,29440448,,,,,,,,
YLKNSTLFNHLAK,ub,K,66,true,"Ubiquitination Membrane Proteins",120,33585938,,,,,,,,
YLKNSTLFNHLAK,ub,K,66,true,"upl3 mutant / wildtype",168,35926874,"MaxQuant score",117.9300000,1.0000000,-0.3940316,,,1.3160499747755E-6,-0.1551600
YLKNSTLFNHLAK,ph,S,68,true,"atm and atr DNA damage response",88,25561503,"MASCOT Score",29.0000000,0.9960000,,,,,-1.2000000
NSTLFNHLAK,ph,S,68,true,"atm and atr DNA damage response",88,25561503,"MASCOT Score",39.0000000,0.9520000,,,,,-0.2500000
NSTLFNHLAKTQTPK,ub,K,76,true,"Ubiquitination Membrane Proteins",120,33585938,,,,,,,,
NSTLFNHLAKTQTPK,ub,K,76,true,"upl3 mutant / wildtype",168,35926874,"MaxQuant score",140.2200000,1.0000000,-0.3075728,0.1514030,NO,3.7527900925705E-11,-0.0927570
FLVFACSDSR,acy,C,87,true,"Arabidopsis S-acylation atlas - Leaf",163c,35681017,,,,,,,,
FLVFACSDSR,ox,C,87,true,"SPEAR - 10 mM H2O2 / mock",138a,34619326,,,,3.6733277,0.0001847,YES,,
NIANMVPPFDQKR,ac,K,121,true,"Quantitative Acetylproteomics",101,29440448,,,,,,,,
NIANMVPPFDQKR,ub,K,121,true,"upl3 mutant / wildtype",168,35926874,"MaxQuant score",100.0200000,1.0000000,-1.1328943,0.1721970,NO,1.7739699615049E-5,0.1862500
SIEDDAAPT,nt,S,158,true,"N-terminal ChaFRADIC",92,26010716,"MASCOT Score",44.7500000,,,,,0.00071809999644756,
DLSYDDQCNKCEK,ac,K,200,true,"Histone deacetylases - apicidin vs control",98a,29061669,"MaxQuant Score",108.3000000,1.0000000,0.2620000,0.3845918,NO,5.9999998484273E-5,
AEVVKNTLAIR,ac,K,225,true,"Quantitative Acetylproteomics",101,29440448,,,,,,,,
