Peptide,PTM,ModifiedAA,ModifiedPosition,PeptideUniqueToGene,ExperimentDesc,ExpID,PubmedID,ScoreType,IdentScore,LocProb,Log2FChange,PQ-val,QuantSig,PEP,MassErrorPPM
TTTDKSAGIVTDSEAGPE,nt,T,24,true,"N-terminal ChaFRADIC",92,26010716,"MASCOT Score",110.5600000,,,,,5.7819997891784E-6,
TTTDKSAGIVTDSEAGPE,nt,T,24,true,"HUNTER N-terminome: legumain, GluC and trypsin",119,31951383,"MaxQuant score",142.8500000,,,,,,
TTTDKSAGIVTDSE,nt,T,24,true,"Arg/N-end rule seed, prt6 vs. Wt",99,29168982,"MASCOT Score",43.3000000,,,,,0.0019160000374541,-0.5687134
TTTDKSAGIVTDSEAGPE,nta,T,24,true,"N-terminal ChaFRADIC",92,26010716,"MASCOT Score",110.5600000,,,,,5.7819997891784E-6,
TTTDKSAGIVTDSEAGPE,nta,T,24,true,"HUNTER N-terminome: legumain, GluC and trypsin",119,31951383,"MaxQuant score",74.9620000,,,,,,
TTTDKSAGIVTDSE,nta,T,24,true,"Arg/N-end rule seed, prt6 vs. Wt",99,29168982,"MASCOT Score",43.3000000,,-0.5408682,0.0753297,NO,0.0019160000374541,-0.5687134
TTTDKSAGIVTDSE,nta,T,24,true,"HUNTER N-terminome: legumain, GluC and trypsin",119,31951383,"MaxQuant score",124.4200000,,,,,,
SAGIVTDSEAGPETSLLLNPHEGSTK,ph,S,52,true,"Tissue atlas Arabidopsis - ProteomicsDB",114,32188942,"MaxQuant score",201.8500000,0.8658470,,,,0,
SAGIVTDSEAGPETSLLLNPHEGSTK,ph,T,53,true,"Tissue atlas Arabidopsis - ProteomicsDB",114,32188942,"MaxQuant score",170.1900000,0.7591740,,,,0,
