Peptide,PTM,ModifiedAA,ModifiedPosition,PeptideUniqueToGene,ExperimentDesc,ExpID,PubmedID,ScoreType,IdentScore,LocProb,Log2FChange,PQ-val,QuantSig,PEP,MassErrorPPM
RASEVPTK,ph,S,9,true,"Tissue atlas Arabidopsis - ProteomicsDB",114,32188942,"MaxQuant score",138.7600000,0.9999500,,,,0.0018159500323236,
LVLENCTNK,sno,C,102,true,"hot5-4 / wildtype, FAT-switch S-nitrosoproteome",169,37277371,,,,-0.1719665,0.0471729,NO,,
AFSSLATR,ph,S,257,false,"Tissue atlas Arabidopsis - ProteomicsDB",114,32188942,"MaxQuant score",107.5500000,0.9966410,,,,0.0039196801371872,
AIDSVICNTSK,ox,C,361,true,"SPEAR - 10 mM H2O2 / mock",138a,34619326,,,,1.0296669,0.0419240,YES,,
AIDSVICNTSK,sno,C,361,true,"hot5-4 / wildtype, FAT-switch S-nitrosoproteome",169,37277371,,,,-0.3145672,0.2538203,NO,,
SVDRASDNSVSASSSTAER,ph,S,893,true,"Tissue atlas Arabidopsis - ProteomicsDB",114,32188942,"MaxQuant score",73.6490000,0.9805810,,,,5.7199598813895E-5,
ASDNSVSASSSTAER,ph,S,896,true,"Tissue atlas Arabidopsis - ProteomicsDB",114,32188942,"MaxQuant score",94.4540000,0.9966940,,,,4.2823299736483E-5,
ASDNSVSASSSTAERESDEDSSNALAVR,ph,S,902,true,"srk2dei ABA signaling phopshoproteomics",83,23572148,"MASCOT Score",72.0000000,,,,,,0.0004000
ASDNSVSASSSTAERESDEDSSNALAVR,ph,T,903,true,"PAMP-triggered phosphorylation",48,24601666,"MASCOT Score",58.2000000,,,,,,
ASDNSVSASSSTAERESDEDSSNALAVR,ph,S,908,true,"PAMP-triggered phosphorylation",48,24601666,"MASCOT Score",46.6300000,,,,,,
ASDNSVSASSSTAERESDEDSSNALAVR,ph,S,908,true,"srk2dei ABA signaling phopshoproteomics",83,23572148,"MASCOT Score",96.0000000,,,,,,0.0005000
ASDNSVSASSSTAERESDEDSSNALAVR,ph,S,908,true,"LAXIC - ABA stress",84a,23660473,XCorr,5.1300000,0.9890000,,,,1.9300000833611E-11,
ASDNSVSASSSTAERESDEDSSNALAVR,ph,S,908,true,"SnRK2 protein kinase substrates",85,23776212,XCorr,5.1615748,0.9970000,,,,0.00017851899610832,
ASDNSVSASSSTAERESDEDSSNALAVR,ph,S,908,true,"atm and atr DNA damage response",88,25561503,"MASCOT Score",45.0000000,1.0000000,,,,,0.5700000
ASDNSVSASSSTAERESDEDSSNALAVR,ph,S,908,true,"Phospho cell culture sucrose/TOR",109,30833711,,,0.9824230,,,,,
ASDNSVSASSSTAERESDEDSSNALAVR,ph,S,908,true,"Col-0 callus - FC Col-0 vs. Col-0 Xray",111a,31410901,,60.0200000,,0.3474319,0.0000000,NO,,1.3378438
ASDNSVSASSSTAERESDEDSSNALAVR,ph,S,908,true,"Col-0 X-ray callus - FC Col-0 vs. Col-0 Xray",111b,31410901,,60.0200000,,0.3474319,0.0000000,NO,,1.3378438
ASDNSVSASSSTAERESDEDSSNALAVR,ph,S,908,true,"atm callus - FC atm vs. atm Xray",111c,31410901,,60.0200000,,0.0454607,0.0000000,NO,,1.3378438
ASDNSVSASSSTAERESDEDSSNALAVR,ph,S,908,true,"atm-3 X-ray callus - FC atm vs. atm Xray",111d,31410901,,60.0200000,,0.0454607,0.0000000,NO,,1.3378438
ESDEDSSNALAVR,ph,S,908,false,"Tissue atlas Arabidopsis - ProteomicsDB",114,32188942,"MaxQuant score",269.9000000,1.0000000,,,,0,
ESDEDSSNALAVR,ph,S,912,false,"Tissue atlas Arabidopsis - ProteomicsDB",114,32188942,"MaxQuant score",190.3400000,0.9610460,,,,3.2523099977647E-30,
YTNPVSIR,ph,S,925,false,"Tissue atlas Arabidopsis - ProteomicsDB",114,32188942,"MaxQuant score",112.1300000,1.0000000,,,,0.0035341801121831,
SSSSQSIWGGHR,ph,S,930,true,"Tissue atlas Arabidopsis - ProteomicsDB",114,32188942,"MaxQuant score",157.0300000,0.9997160,,,,9.553540181173E-10,
SSSSQSIWGGHR,ph,S,931,true,"Tissue atlas Arabidopsis - ProteomicsDB",114,32188942,"MaxQuant score",81.6190000,0.8371340,,,,0.00028040001052432,
SSSSQSIWGGHR,ph,S,933,true,"Tissue atlas Arabidopsis - ProteomicsDB",114,32188942,"MaxQuant score",137.3900000,0.9979340,,,,1.7367499822285E-5,
EFLSVVR,ph,S,943,true,"Tissue atlas Arabidopsis - ProteomicsDB",114,32188942,"MaxQuant score",93.6490000,1.0000000,,,,0.014437699690461,
HLESFNFDSEIPADLPVTSSSHELK,ph,S,973,false,"Tissue atlas Arabidopsis - ProteomicsDB",114,32188942,"MaxQuant score",151.3700000,0.9998890,,,,1.9618178500547E-44,
HLESFNFDSEIPADLPVTSSSHELK,ph,S,989,false,"PAMP-triggered phosphorylation",48,24601666,"MASCOT Score",33.0900000,,,,,,
HLESFNFDSEIPADLPVTSSSHELK,ph,S,989,false,"Col-0 callus - FC Col-0 vs. Col-0 Xray",111a,31410901,,47.3400000,,0.6980406,0.0000000,NO,,-0.0880148
HLESFNFDSEIPADLPVTSSSHELK,ph,S,989,false,"Col-0 X-ray callus - FC Col-0 vs. Col-0 Xray",111b,31410901,,47.3400000,,0.6980406,0.0000000,NO,,-0.0880148
HLESFNFDSEIPADLPVTSSSHELK,ph,S,989,false,"atm callus - FC atm vs. atm Xray",111c,31410901,,47.3400000,,1.7247095,0.0000000,NO,,-0.0880148
HLESFNFDSEIPADLPVTSSSHELK,ph,S,989,false,"atm-3 X-ray callus - FC atm vs. atm Xray",111d,31410901,,47.3400000,,1.7247095,0.0000000,NO,,-0.0880148
HLESFNFDSEIPADLPVTSSSHELK,ph,S,989,false,"Tissue atlas Arabidopsis - ProteomicsDB",114,32188942,"MaxQuant score",220.6300000,0.7688780,,,,0,
LNCTLR,sno,C,1011,false,"hot5-4 / wildtype, FAT-switch S-nitrosoproteome",169,37277371,,,,,,,,
NLWSHSKWLVDTLQNYCR,ub,K,1152,true,"Ubiquitylome analysis innate immunity",124,33793954,,,,,,,,
DALSSDVAK,ph,S,1524,false,"atm and atr DNA damage response",88,25561503,"MASCOT Score",44.0000000,0.9590000,,,,,-1.3300000
DALSSDVAK,ph,S,1524,false,"Tissue atlas Arabidopsis - ProteomicsDB",114,32188942,"MaxQuant score",68.5360000,0.7956300,,,,0.011719799600542,
DALSSDVAK,ph,S,1525,false,"Tissue atlas Arabidopsis - ProteomicsDB",114,32188942,"MaxQuant score",78.5130000,0.9310720,,,,0.0052116899751127,
VSGSEHGFSLNEPLGISENK,ph,S,1703,false,"Lateral root-induction - NAA vs control",106,23328941,"MASCOT Score",23.0000000,,,,,,
VSGSEHGFSLNEPLGISENK,ph,S,1703,false,"Phospho cell culture sucrose/TOR",109,30833711,,,0.8442220,,,,,
VSGSEHGFSLNEPLGISENK,ph,S,1703,false,"Tissue atlas Arabidopsis - ProteomicsDB",114,32188942,"MaxQuant score",296.5300000,0.9524670,,,,0,
VSGSEHGFSLNEPLGISENK,ph,S,1705,false,"PAMP-triggered phosphorylation",48,24601666,"MASCOT Score",58.5600000,,,,,,
VSGSEHGFSLNEPLGISENK,ph,S,1705,false,"srk2dei ABA signaling phopshoproteomics",83,23572148,"MASCOT Score",60.0000000,,,,,,-0.0001000
VSGSEHGFSLNEPLGISENK,ph,S,1705,false,"SnRK2 protein kinase substrates",85,23776212,XCorr,4.1899419,0.9330000,,,,1.6121299850624E-9,
VSGSEHGFSLNEPLGISENK,ph,S,1705,false,"atm and atr DNA damage response",88,25561503,"MASCOT Score",29.0000000,0.9930000,,,,,-0.6500000
VSGSEHGFSLNEPLGISENK,ph,S,1705,false,"Lateral root-induction - NAA vs control",106,23328941,"MASCOT Score",39.0000000,,0.0983091,0.7486836,NO,,
VSGSEHGFSLNEPLGISENK,ph,S,1705,false,"Phospho cell culture sucrose/TOR",109,30833711,,,0.9281440,,,,,
VSGSEHGFSLNEPLGISENK,ph,S,1705,false,"Col-0 callus - FC Col-0 vs. Col-0 Xray",111a,31410901,,88.1700000,,0.8524685,0.0392571,YES,,0.9862561
VSGSEHGFSLNEPLGISENK,ph,S,1705,false,"Col-0 X-ray callus - FC Col-0 vs. Col-0 Xray",111b,31410901,,88.1700000,,0.8524685,0.0392571,YES,,0.9862561
VSGSEHGFSLNEPLGISENK,ph,S,1705,false,"atm callus - FC atm vs. atm Xray",111c,31410901,,88.1700000,,1.0763714,0.5049813,NO,,0.9862561
VSGSEHGFSLNEPLGISENK,ph,S,1705,false,"atm-3 X-ray callus - FC atm vs. atm Xray",111d,31410901,,88.1700000,,1.0763714,0.5049813,NO,,0.9862561
VSGSEHGFSLNEPLGISENK,ph,S,1705,false,"Tissue atlas Arabidopsis - ProteomicsDB",114,32188942,"MaxQuant score",494.7600000,0.9997500,,,,0,
VSGSEHGFSLNEPLGISENK,ph,S,1710,false,"srk2dei ABA signaling phopshoproteomics",83,23572148,"MASCOT Score",51.0000000,,,,,,0.0009000
VSGSEHGFSLNEPLGISENK,ph,S,1710,false,"LAXIC - ABA stress",84a,23660473,XCorr,4.6300000,0.8790000,,,,1.2799999922208E-6,
VSGSEHGFSLNEPLGISENK,ph,S,1710,false,"LAXIC - mannitol vs control",84b,23660473,XCorr,5.0400000,0.9320000,,,,6.6599998356943E-16,
VSGSEHGFSLNEPLGISENK,ph,S,1710,false,"Lateral root-induction - NAA vs control",106,23328941,"MASCOT Score",25.0000000,,0.0989369,0.7467131,NO,,
VSGSEHGFSLNEPLGISENK,ph,S,1710,false,"Col-0 callus - FC Col-0 vs. Col-0 Xray",111a,31410901,,49.7200000,,3.1063733,0.0000000,NO,,0.3717564
VSGSEHGFSLNEPLGISENK,ph,S,1710,false,"Col-0 X-ray callus - FC Col-0 vs. Col-0 Xray",111b,31410901,,49.7200000,,3.1063733,0.0000000,NO,,0.3717564
VSGSEHGFSLNEPLGISENK,ph,S,1710,false,"atm callus - FC atm vs. atm Xray",111c,31410901,,49.7200000,,0.1450370,0.0000000,NO,,0.3717564
VSGSEHGFSLNEPLGISENK,ph,S,1710,false,"atm-3 X-ray callus - FC atm vs. atm Xray",111d,31410901,,49.7200000,,0.1450370,0.0000000,NO,,0.3717564
VSGSEHGFSLNEPLGISENK,ph,S,1710,false,"Tissue atlas Arabidopsis - ProteomicsDB",114,32188942,"MaxQuant score",83.7010000,0.9522950,,,,1.397239990375E-9,
GSNLPDDSPGNGGLIYHVIHR,ph,S,1844,false,"Tissue atlas Arabidopsis - ProteomicsDB",114,32188942,"MaxQuant score",157.9000000,1.0000000,,,,6.068829821205E-30,
SSSQSVLLPDKR,ph,S,1917,true,"Tissue atlas Arabidopsis - ProteomicsDB",114,32188942,"MaxQuant score",54.3150000,0.7691450,,,,0.0049747200682759,
NSSSSNFPGCGCSPDVAK,sno,C,1950,true,"hot5-4 / wildtype, FAT-switch S-nitrosoproteome",169,37277371,,,,,,,,
SEVPNEQKNTDSDER,ph,T,2018,true,"Tissue atlas Arabidopsis - ProteomicsDB",114,32188942,"MaxQuant score",76.0270000,0.9587610,,,,0.0001501569931861,
GSSLTQAMLQEMR,ph,S,2072,true,"Tissue atlas Arabidopsis - ProteomicsDB",114,32188942,"MaxQuant score",204.1300000,0.9975750,,,,9.6767898596599E-39,
EEIEGDQIEMSFHVEDR,ph,S,2111,true,"Tissue atlas Arabidopsis - ProteomicsDB",114,32188942,"MaxQuant score",125.7700000,1.0000000,,,,3.6149599980106E-10,
QTGRSSFDR,ph,S,2278,true,"Tissue atlas Arabidopsis - ProteomicsDB",114,32188942,"MaxQuant score",84.1690000,0.8797250,,,,0.00085662899073213,
SGSEVHGFQHPLFSR,ph,S,2285,false,"atm and atr DNA damage response",88,25561503,"MASCOT Score",61.0000000,0.8950000,,,,,-0.3100000
SGSEVHGFQHPLFSR,ph,S,2285,false,"Phospho cell culture sucrose/TOR",109,30833711,,,0.9219390,,,,,
SGSEVHGFQHPLFSR,ph,S,2285,false,"Tissue atlas Arabidopsis - ProteomicsDB",114,32188942,"MaxQuant score",180.0800000,0.9985740,,,,0,
PSQTGNTASVSASAGSISR,ph,S,2306,false,"Tissue atlas Arabidopsis - ProteomicsDB",114,32188942,"MaxQuant score",207.3700000,0.9877970,,,,0,
PSQTGNTASVSASAGSISR,ph,S,2308,false,"atm and atr DNA damage response",88,25561503,"MASCOT Score",38.0000000,0.9070000,,,,,0.4800000
PSQTGNTASVSASAGSISR,ph,S,2310,false,"atm and atr DNA damage response",88,25561503,"MASCOT Score",68.0000000,1.0000000,,,,,0.0400000
PSQTGNTASVSASAGSISR,ph,S,2313,false,"atm and atr DNA damage response",88,25561503,"MASCOT Score",68.0000000,0.9990000,,,,,0.0400000
PSQTGNTASVSASAGSISR,ph,S,2313,false,"Tissue atlas Arabidopsis - ProteomicsDB",114,32188942,"MaxQuant score",324.2300000,0.9953840,,,,0,
PSQTGNTASVSASAGSISR,ph,S,2315,false,"atm and atr DNA damage response",88,25561503,"MASCOT Score",54.0000000,0.9950000,,,,,0.0200000
LGGGGAPPPLTDYSVVGMDSSR,ph,S,2363,true,"Tissue atlas Arabidopsis - ProteomicsDB",114,32188942,"MaxQuant score",119.3800000,0.9750550,,,,2.4952700873809E-21,
NDEQVDEGSLDGRAPEVNAIDPTFLEALPEDLR,ph,S,2582,true,"SnRK2 protein kinase substrates",85,23776212,XCorr,5.0200958,1.0000000,,,,0.00045417400542647,
NDEQVDEGSLDGRAPEVNAIDPTFLEALPEDLR,ph,S,2582,true,"TOR Kinase and ABA Receptor",100,29290610,XCorr,4.6996675,0.9995000,,,,0.00025740001001395,
NDEQVDEGSLDGR,ph,S,2582,true,"STN8 phosphoproteome",38,21768351,"MASCOT Score",93.9100000,,,,,,-1.0606100
NDEQVDEGSLDGR,ph,S,2582,true,"Tyrosine phosphorylation in Arabidopsis",59,18463617,"MASCOT Score",85.0000000,,,,,,-0.7933508
NDEQVDEGSLDGR,ph,S,2582,true,"Chloroplast kinase substrates",60,19376835,"MASCOT Score",85.2500000,,,,,,-2.7772500
NDEQVDEGSLDGR,ph,S,2582,true,"LAXIC - ABA stress",84a,23660473,XCorr,4.4500000,1.0000000,,,,7.3199998951168E-6,
NDEQVDEGSLDGR,ph,S,2582,true,"LAXIC - mannitol vs control",84b,23660473,XCorr,4.6500000,1.0000000,1.5627664,,NO,6.9500001999116E-14,
NDEQVDEGSLDGR,ph,S,2582,true,"SnRK2 protein kinase substrates",85,23776212,XCorr,4.0182824,1.0000000,,,,0.027775499969721,
NDEQVDEGSLDGR,ph,S,2582,true,"atm and atr DNA damage response",88,25561503,"MASCOT Score",69.0000000,1.0000000,,,,,-0.1200000
NDEQVDEGSLDGR,ph,S,2582,true,"TOR Kinase and ABA Receptor",100,29290610,XCorr,4.3399353,1.0000000,,,,3.3250000797125E-7,
NDEQVDEGSLDGR,ph,S,2582,true,"Lateral root-induction - NAA vs control",106,23328941,"MASCOT Score",44.0000000,,0.1540577,0.5814013,NO,,
NDEQVDEGSLDGR,ph,S,2582,true,"Phospho cell culture sucrose/TOR",109,30833711,,,1.0000000,,,,,
NDEQVDEGSLDGR,ph,S,2582,true,"Col-0 callus - FC Col-0 vs. Col-0 Xray",111a,31410901,,70.4100000,,-1.4164998,0.0000000,NO,,0.9975308
NDEQVDEGSLDGR,ph,S,2582,true,"Col-0 X-ray callus - FC Col-0 vs. Col-0 Xray",111b,31410901,,70.4100000,,-1.4164998,0.0000000,NO,,0.9975308
NDEQVDEGSLDGR,ph,S,2582,true,"atm callus - FC atm vs. atm Xray",111c,31410901,,70.4100000,,-1.6978698,0.0000000,NO,,0.9975308
NDEQVDEGSLDGR,ph,S,2582,true,"atm-3 X-ray callus - FC atm vs. atm Xray",111d,31410901,,70.4100000,,-1.6978698,0.0000000,NO,,0.9975308
NDEQVDEGSLDGR,ph,S,2582,true,"Tissue atlas Arabidopsis - ProteomicsDB",114,32188942,"MaxQuant score",321.0900000,1.0000000,,,,0,
VFGSSHR,ph,S,2724,false,"Tissue atlas Arabidopsis - ProteomicsDB",114,32188942,"MaxQuant score",88.8190000,0.8266690,,,,0.01811490021646,
VFGSSHR,ph,S,2725,false,"Tissue atlas Arabidopsis - ProteomicsDB",114,32188942,"MaxQuant score",102.6200000,0.8665200,,,,0.01811490021646,
DVSSSADGLK,ph,S,2756,true,"atm and atr DNA damage response",88,25561503,"MASCOT Score",64.0000000,1.0000000,,,,,-1.6300000
DVSSSADGLK,ph,S,2756,true,"Tissue atlas Arabidopsis - ProteomicsDB",114,32188942,"MaxQuant score",90.6530000,0.9795070,,,,0.0012016800465062,
DVSSSADGLK,ph,S,2757,true,"Tissue atlas Arabidopsis - ProteomicsDB",114,32188942,"MaxQuant score",77.5410000,0.7993250,,,,0.0035777299199253,
DVSSSADGLK,ph,S,2758,true,"atm and atr DNA damage response",88,25561503,"MASCOT Score",38.0000000,0.9980000,,,,,-1.8200000
DVSSSADGLK,ph,S,2758,true,"Phospho cell culture sucrose/TOR",109,30833711,,,0.7945550,,,,,
DVSSSADGLK,ph,S,2758,true,"Tissue atlas Arabidopsis - ProteomicsDB",114,32188942,"MaxQuant score",113.9500000,0.9973650,,,,9.5007897471078E-5,
LENKPVGEEASSETQKDAESELSVAR,ph,S,2977,true,"Tissue atlas Arabidopsis - ProteomicsDB",114,32188942,"MaxQuant score",177.8600000,0.7643380,,,,0,
LENKPVGEEASSETQK,ph,S,2978,true,"TOR Kinase and ABA Receptor",100,29290610,XCorr,4.7332425,0.9993000,,,,8.0600002547726E-5,
LENKPVGEEASSETQK,ph,S,2978,true,"Tissue atlas Arabidopsis - ProteomicsDB",114,32188942,"MaxQuant score",167.9000000,0.9397630,,,,8.063029874825E-19,
LENKPVGEEASSETQKDAESELSVAR,ph,T,2980,true,"Tissue atlas Arabidopsis - ProteomicsDB",114,32188942,"MaxQuant score",92.7610000,0.9435690,,,,6.7099599565057E-15,
LENKPVGEEASSETQK,ph,T,2980,true,"TOR Kinase and ABA Receptor",100,29290610,XCorr,2.8099952,0.9901000,,,,0.0022259999532253,
DAESELSVAR,ph,S,2986,true,"Tyrosine phosphorylation in Arabidopsis",59,18463617,"MASCOT Score",55.0000000,,,,,,-0.8654413
DAESELSVAR,ph,S,2986,true,"srk2dei ABA signaling phopshoproteomics",83,23572148,"MASCOT Score",33.0000000,,,,,,0.0014000
DAESELSVAR,ph,S,2986,true,"atm and atr DNA damage response",88,25561503,"MASCOT Score",54.0000000,1.0000000,,,,,-0.1200000
DAESELSVAR,ph,S,2986,true,"TOR Kinase and ABA Receptor",100,29290610,XCorr,2.4179876,0.9990000,,,,0.00067269999999553,
DAESELSVAR,ph,S,2986,true,"Tissue atlas Arabidopsis - ProteomicsDB",114,32188942,"MaxQuant score",183.9900000,1.0000000,,,,2.3374600067502E-28,
DAESELSVAR,ph,S,2989,true,"Pollen phosphoproteome Arabidopsis",43,22631563,"MASCOT Score",56.3800000,,,,,,-0.4055160
DAESELSVAR,ph,S,2989,true,"Tissue atlas Arabidopsis - ProteomicsDB",114,32188942,"MaxQuant score",169.8900000,1.0000000,,,,2.7357199838818E-10,
MRSPQDLK,ph,S,3317,false,"atm and atr DNA damage response",88,25561503,"MASCOT Score",27.0000000,1.0000000,,,,,-1.8000000
MRSPQDLK,ph,S,3317,false,"Tissue atlas Arabidopsis - ProteomicsDB",114,32188942,"MaxQuant score",82.4520000,1.0000000,,,,0.015576199628413,
FLQFVTGTSKVPLEGFK,ub,K,3589,false,"upl3 mutant / wildtype",168,35926874,"MaxQuant score",68.8450000,1.0000000,-0.3022262,0.5596800,NO,7.6308897405397E-5,-2.1076000
AYGSPERLPSAHTCFNQLDLPEYQSK,ph,S,3615,true,"Tissue atlas Arabidopsis - ProteomicsDB",114,32188942,"MaxQuant score",288.0400000,0.9999980,,,,0,
LPSAHTCFNQLDLPEYQSK,so,C,3625,false,"Arabidopsis S-sulfenylation chemoproteomics",108,31578252,"pFind PSM Score",0.0964863,,,,,,-0.4311702
