Peptide,PTM,ModifiedAA,ModifiedPosition,PeptideUniqueToGene,ExperimentDesc,ExpID,PubmedID,ScoreType,IdentScore,LocProb,Log2FChange,PQ-val,QuantSig,PEP,MassErrorPPM
SSTQEASVTDLPVKRPR,nt,S,2,true,"Stromal N-terminome",96,26371235,"MASCOT Score",32.3600000,,,,,,
SSTQEASVTDLPVKRPR,nt,S,2,true,"FtsH12 N-terminome: WT / FtsH12 knockdown miRNA",118,33216923,"MaxQuant score",132.3100000,,0.1487298,0.5550618,NO,0,
SSTQEASVTDLPVKR,nt,S,2,true,"Arg/N-end rule seed, prt6 vs. Wt",99,29168982,"MASCOT Score",63.2200000,,,,,0.00079770002048463,-2.2937723
SSTQEASVTDLPVKR,nt,S,2,true,"FtsH12 N-terminome: WT / FtsH12 knockdown miRNA",118,33216923,"MaxQuant score",53.4530000,,0.2558115,0.0971654,NO,0.00088680000044405,
SSTQEASVTD,nt,S,2,true,"N-term acetylation drought responses",5,26184543,,,,,,,,
SSTQEASVTDLPVKRPREAEEDNN,nta,S,2,true,"HUNTER N-terminome: legumain, GluC and trypsin",119,31951383,"MaxQuant score",,,,,,,
SSTQEASVTDLPVKRPREAEEDN,nta,S,2,true,"HUNTER N-terminome: legumain, GluC and trypsin",119,31951383,"MaxQuant score",109.7500000,,,,,,
SSTQEASVTDLPVKRPR,nta,S,2,true,"Arg/N-end rule pathway Roots",80,25728785,"MASCOT Score",38.4600000,,,,,0.024819999933243,
SSTQEASVTDLPVKRPR,nta,S,2,true,"Stromal N-terminome",96,26371235,"MASCOT Score",32.3600000,,,,,,
SSTQEASVTDLPVKRPR,nta,S,2,true,"HUNTER N-terminome: legumain, GluC and trypsin",119,31951383,"MaxQuant score",92.5750000,,,,,,
SSTQEASVTDLPVKRPR,nta,S,2,true,"Arabidopsis translation initiation landscape - NTA",167a,35069635,,,,,,,,
SSTQEASVTDLPVKR,nta,S,2,true,"Arg/N-end rule seed, prt6 vs. Wt",99,29168982,"MASCOT Score",63.2200000,,-0.1764440,0.5654787,NO,0.00079770002048463,-2.2937723
SSTQEASVTDLPVK,nta,S,2,true,"Characterization plant N-terminal acetylation",6,22223895,"MASCOT Score",97.4200000,,,,,,
SSTQEASVTD,nta,S,2,true,"N-term acetylation drought responses",5,26184543,,,,,,,,
SSTQEASVTDLPVK,ph,S,2,true,"atm and atr DNA damage response",88,25561503,"MASCOT Score",60.0000000,0.9280000,,,,,-1.2500000
SSTQEASVTDLPVK,ph,S,3,true,"atm and atr DNA damage response",88,25561503,"MASCOT Score",59.0000000,0.8630000,,,,,-1.0400000
SSTQEASVTDLPVK,ph,T,4,true,"Lateral root-induction - NAA vs control",106,23328941,"MASCOT Score",21.0000000,,,,,,
SSTQEASVTDLPVK,ph,S,8,true,"Tissue atlas Arabidopsis - ProteomicsDB",114,32188942,"MaxQuant score",184.4800000,0.9998630,,,,1.8771099856471E-23,
SSTQEASVTDLPVKRPR,ub,K,15,true,"upl3 mutant / wildtype",168,35926874,"MaxQuant score",110.1200000,1.0000000,0.2314324,0.7492000,NO,7.1002501655926E-9,-0.2572700
GVIQLTER,nt,G,98,false,"Arg/N-end rule seed, prt6 vs. Wt",99,29168982,"MASCOT Score",28.3500000,,-0.2594357,0.3382258,NO,0.21799999475479,-0.4396650
HSSVEQIDICEIDK,ph,S,146,true,"Large-scale phosphorylation discovery",44,23111157,XCorr,5.9220000,,,,,,
HSSVEQIDICEIDK,ph,S,146,true,"Tissue atlas Arabidopsis - ProteomicsDB",114,32188942,"MaxQuant score",126.2500000,0.9679910,,,,3.7312700442271E-5,
HSSVEQIDICEIDK,ph,S,147,true,"Tissue atlas Arabidopsis - ProteomicsDB",114,32188942,"MaxQuant score",198.3000000,0.9980830,,,,6.3117099467543E-32,
HSSVEQIDICEIDK,ox,C,154,true,"SPEAR - 10 mM H2O2 / mock",138a,34619326,,,,0.9481869,0.0334744,YES,,
HSSVEQIDICEIDK,so,C,154,true,"Arabidopsis S-sulfenylation chemoproteomics",108,31578252,"pFind PSM Score",0.0001516,,0.8000000,,,,-0.6108103
HSSVEQIDICEIDK,so,C,154,true,"S-sulfenylation site detection using YAP1C",110,32714340,,,,,,,,
TYDAVIVDSSDPIGPAKE,nta,T,198,true,"Arabidopsis translation initiation landscape - NTA",167a,35069635,,,,,,,,
IIEDIVSNCR,nt,I,248,false,"Arg/N-end rule seed, prt6 vs. Wt",99,29168982,"MASCOT Score",28.4900000,,-0.9476233,0.0240995,NO,0.020509999245405,-2.3966302
KPVSLIDTDESSIK,ph,S,305,true,"Tissue atlas Arabidopsis - ProteomicsDB",114,32188942,"MaxQuant score",195.1700000,0.8266180,,,,9.7120601043893E-32,
KPVSLIDTDESSIKSHCPLK,ub,K,308,true,"upl3 mutant / wildtype",168,35926874,"MaxQuant score",125.2300000,1.0000000,-1.1171613,0.1913190,NO,3.2908199006521E-14,1.0532000
SHCPLK,sno,C,311,true,"hot5-4 / wildtype, FAT-switch S-nitrosoproteome",169,37277371,,,,0.5727667,0.0003245,NO,,
