Peptide,PTM,ModifiedAA,ModifiedPosition,PeptideUniqueToGene,ExperimentDesc,ExpID,PubmedID,ScoreType,IdentScore,LocProb,Log2FChange,PQ-val,QuantSig,PEP,MassErrorPPM
FENDSLSWEK,ph,S,40,false,"Tissue atlas Arabidopsis - ProteomicsDB",114,32188942,"MaxQuant score",171.2600000,0.9999650,,,,1.5334499892106E-7,
FSSFSPNK,ph,S,46,true,"Tissue atlas Arabidopsis - ProteomicsDB",114,32188942,"MaxQuant score",99.6630000,0.9910860,,,,4.3172298319405E-5,
FSSFSPNK,ph,S,48,true,"srk2dei ABA signaling phopshoproteomics",83,23572148,"MASCOT Score",37.0000000,,,,,,0.0007000
FSSFSPNK,ph,S,48,true,"atm and atr DNA damage response",88,25561503,"MASCOT Score",36.0000000,0.9990000,,,,,-1.5500000
FSSFSPNK,ph,S,48,true,"TOR Kinase and ABA Receptor",100,29290610,XCorr,2.4251082,0.9999000,,,,0.0060959998518229,
FSSFSPNK,ph,S,48,true,"Tissue atlas Arabidopsis - ProteomicsDB",114,32188942,"MaxQuant score",191.0100000,0.9999980,,,,8.3838699924843E-34,
NASFRPNIQNR,ph,S,99,true,"Phosphoproteome ethylene-regulated time response",46,24043427,"MASCOT Score",26.0100000,,,,,,7.3616000
NASFRPNIQNR,ph,S,99,true,"srk2dei ABA signaling phopshoproteomics",83,23572148,"MASCOT Score",40.0000000,,,,,,-0.0006000
NASFRPNIQNR,ph,S,99,true,"atm and atr DNA damage response",88,25561503,"MASCOT Score",46.0000000,1.0000000,,,,,-0.0600000
NASFRPNIQNR,ph,S,99,true,"TOR Kinase and ABA Receptor",100,29290610,XCorr,2.1224005,1.0000000,,,,0.0010319999419153,
NASFRPNIQNR,ph,S,99,true,"Tissue atlas Arabidopsis - ProteomicsDB",114,32188942,"MaxQuant score",144.1000000,1.0000000,,,,8.2229398401523E-8,
ECRSSVDTGDDLSTLK,ph,S,168,true,"atm and atr DNA damage response",88,25561503,"MASCOT Score",36.0000000,1.0000000,,,,,-0.6000000
SSVDTGDDLSTLKLEEK,ph,S,169,true,"Tissue atlas Arabidopsis - ProteomicsDB",114,32188942,"MaxQuant score",142.4000000,0.8273250,,,,8.02817014256E-12,
ECRSSVDTGDDLSTLK,ph,S,169,true,"atm and atr DNA damage response",88,25561503,"MASCOT Score",36.0000000,1.0000000,,,,,-0.6000000
SSVDTGDDLSTLK,ph,S,169,true,"atm and atr DNA damage response",88,25561503,"MASCOT Score",20.0000000,0.9950000,,,,,-1.3800000
AASPVLKPPGFSTPR,ph,S,289,true,"atm and atr DNA damage response",88,25561503,"MASCOT Score",40.0000000,1.0000000,,,,,-0.2200000
AASPVLKPPGFSTPR,ph,S,289,true,"Tissue atlas Arabidopsis - ProteomicsDB",114,32188942,"MaxQuant score",73.7830000,1.0000000,,,,9.6974799816962E-5,
SASTISSMSTSR,ph,S,307,true,"atm and atr DNA damage response",88,25561503,"MASCOT Score",41.0000000,0.9260000,,,,,-0.3200000
SASTISSMSTSR,ph,S,307,true,"TOR Kinase and ABA Receptor",100,29290610,XCorr,3.5132833,0.7767000,,,,6.2099999922793E-5,
SASTISSMSTSR,ph,S,307,true,"Tissue atlas Arabidopsis - ProteomicsDB",114,32188942,"MaxQuant score",97.4630000,0.9663580,,,,4.5191300159786E-5,
SFQKSFDQMK,ph,S,382,true,"Tissue atlas Arabidopsis - ProteomicsDB",114,32188942,"MaxQuant score",94.7380000,0.9999990,,,,0.0011602300219238,
SFDQMKSTDDGQDTAPK,ph,S,388,true,"atm and atr DNA damage response",88,25561503,"MASCOT Score",27.0000000,0.9920000,,,,,0.9900000
SFDQMKSTDDGQDTAPK,ph,S,388,true,"Tissue atlas Arabidopsis - ProteomicsDB",114,32188942,"MaxQuant score",162.4400000,0.9380070,,,,2.1900899766075E-16,
