Peptide,PTM,ModifiedAA,ModifiedPosition,PeptideUniqueToGene,ExperimentDesc,ExpID,PubmedID,ScoreType,IdentScore,LocProb,Log2FChange,PQ-val,QuantSig,PEP,MassErrorPPM
PPATGDIDRQIE,nt,P,2,true,"N-terminal ChaFRADIC",92,26010716,"MASCOT Score",43.8100000,,,,,0.0039969999343157,
PPATGDIDR,nt,P,2,true,"Arabidopsis translation initiation landscape - NT",167b,35069635,,,,,,,,
SRQITQVYGFYDE,nt,S,118,false,"Arabidopsis translation initiation landscape - NT",167b,35069635,,,,,,,,
QITQVYGFYDECLR,nt,Q,120,false,"HUNTER N-terminome: legumain, GluC and trypsin",119,31951383,"MaxQuant score",124.8600000,,,,,,
QITQVYGFYDECLRK,so,C,131,false,"Arabidopsis S-sulfenylation chemoproteomics",108,31578252,"pFind PSM Score",0.0002612,,,,,,-1.1928776
IQEVPHEGPMCDLLWSDPDDR,sno,C,194,false,"Site-specific nitrosomeproteomic id - gsnor1-3",90a,25699590,XCorr,3.1727107,,,,,8.9730001491262E-6,-2.9971666
IQEVPHEGPMCDLLWSDPDDR,sno,C,194,false,"Site-specific nitrosomeproteomic id - gsnor1-3",90b,25699590,XCorr,3.0600000,,,,,3.5329998354428E-5,-3.7500000
CGWGISPR,acy,C,205,false,"Arabidopsis S-acylation atlas - Meristem",163a,35681017,,,,,,,,
CGWGISPR,ox,C,205,false,"SPEAR - 10 mM H2O2 / mock",138a,34619326,,,,5.8023103,0.0221343,YES,,
CGWGISPR,so,C,205,false,"S-sulfenylation site detection using YAP1C",110,32714340,,,,,,,,
CGWGISPR,ph,S,210,false,"Tissue atlas Arabidopsis - ProteomicsDB",114,32188942,"MaxQuant score",130.9800000,1.0000000,,,,0.0029158100951463,
