Peptide,PTM,ModifiedAA,ModifiedPosition,PeptideUniqueToGene,ExperimentDesc,ExpID,PubmedID,ScoreType,IdentScore,LocProb,Log2FChange,PQ-val,QuantSig,PEP,MassErrorPPM
FSSPASSFNSSVSSDGSNLGSPGQK,ph,S,163,true,"Tissue atlas Arabidopsis - ProteomicsDB",114,32188942,"MaxQuant score",268.2500000,0.9902820,,,,0,
FSSPASSFNSSVSSDGSNLGSPGQK,ph,S,166,true,"Tissue atlas Arabidopsis - ProteomicsDB",114,32188942,"MaxQuant score",193.3600000,0.8555800,,,,0,
LLTFGSSESIGSDPGSLVSVSSSKLMFTPSR,ph,S,191,true,"Brassinosteroid-Regulated Phosphorylation Dynamics",94,26187819,"MaxQuant Score",56.5620000,0.8650000,,,,0.048000000417233,4.5500000
LLTFGSSESIGSDPGSLVSVSSSKLMFTPSR,ph,S,194,true,"Brassinosteroid-Regulated Phosphorylation Dynamics",94,26187819,"MaxQuant Score",56.5620000,0.8330000,,,,0.048000000417233,4.5500000
LLTFGSSESIGSDPGSLVSVSSSK,ph,S,207,true,"Large-scale phosphorylation discovery",44,23111157,XCorr,5.7640000,,,,,,
SGTLSPKPTER,ph,S,217,true,"Tissue atlas Arabidopsis - ProteomicsDB",114,32188942,"MaxQuant score",134.4900000,0.9876500,,,,4.7742400965944E-6,
SGTLSPKPTER,ph,T,219,true,"Tissue atlas Arabidopsis - ProteomicsDB",114,32188942,"MaxQuant score",92.7470000,0.8894900,,,,0.0013420300092548,
SGTLSPKPTER,ph,S,221,true,"Tissue atlas Arabidopsis - ProteomicsDB",114,32188942,"MaxQuant score",124.6200000,0.9999050,,,,3.9443898458558E-6,
