Peptide,PTM,ModifiedAA,ModifiedPosition,PeptideUniqueToGene,ExperimentDesc,ExpID,PubmedID,ScoreType,IdentScore,LocProb,Log2FChange,PQ-val,QuantSig,PEP,MassErrorPPM
LDSSVEWEPVR,ph,S,90,true,"Tissue atlas Arabidopsis - ProteomicsDB",114,32188942,"MaxQuant score",196.1500000,0.9656360,,,,3.515319907184E-18,
RPSYTYSPVSR,ph,S,170,true,"atm and atr DNA damage response",88,25561503,"MASCOT Score",61.0000000,1.0000000,,,,,-0.2500000
RPSYTYSPVSR,ph,S,170,true,"Tissue atlas Arabidopsis - ProteomicsDB",114,32188942,"MaxQuant score",84.3650000,0.9978410,,,,0.00057240400929004,
RPSYTYSPVSR,ph,T,172,true,"atm and atr DNA damage response",88,25561503,"MASCOT Score",61.0000000,0.9950000,,,,,-0.2500000
RPSYTYSPVSR,ph,S,174,true,"Tissue atlas Arabidopsis - ProteomicsDB",114,32188942,"MaxQuant score",81.8770000,0.9874970,,,,0.00076984200859442,
RPSYTYSPVSR,ph,S,177,true,"atm and atr DNA damage response",88,25561503,"MASCOT Score",34.0000000,1.0000000,,,,,1.7900000
TSSEKSEEELTVPPPK,ph,T,179,true,"Large-scale phosphorylation discovery",44,23111157,XCorr,3.3570000,,,,,,
TSSEKSEEELTVPPPK,ph,S,181,true,"Tissue atlas Arabidopsis - ProteomicsDB",114,32188942,"MaxQuant score",119.6200000,0.9611820,,,,2.6241801265314E-7,
TSSEKSEEELTVPPPK,ph,S,184,true,"Tissue atlas Arabidopsis - ProteomicsDB",114,32188942,"MaxQuant score",83.8940000,0.9954800,,,,0.00019772700034082,
