Peptide,PTM,ModifiedAA,ModifiedPosition,PeptideUniqueToGene,ExperimentDesc,ExpID,PubmedID,ScoreType,IdentScore,LocProb,Log2FChange,PQ-val,QuantSig,PEP,MassErrorPPM
ATSSDTAVVETAQSDDVIFKEIFPVQR,nt,A,66,true,"Stromal N-terminome",96,26371235,"MASCOT Score",59.9300000,,,,,,
ATSSDTAVVETAQSDDVIFKEIFPVQR,nt,A,66,true,"HUNTER N-terminome: legumain, GluC and trypsin",119,31951383,"MaxQuant score",105.7300000,,,,,,
ATSSDTAVVETAQSDDVIFKEIFPVQR,nt,A,66,true,"Arabidopsis translation initiation landscape - NT",167b,35069635,,,,,,,,
TSSDTAVVETAQSDDVIFKEIFPVQR,nt,T,67,true,"Stromal N-terminome",96,26371235,"MASCOT Score",92.1700000,,,,,,
TSSDTAVVETAQSDDVIFKEIFPVQR,nt,T,67,true,"HUNTER N-terminome: legumain, GluC and trypsin",119,31951383,"MaxQuant score",149.7400000,,,,,,
TSSDTAVVE,nt,T,67,true,"N-terminal ChaFRADIC",92,26010716,"MASCOT Score",56.4400000,,,,,0.03319999948144,
TSSDTAVVE,nt,T,67,true,"Arg/N-end rule seed, prt6 vs. Wt",99,29168982,"MASCOT Score",62.6200000,,0.2791360,0.0340226,NO,0.00043889999506064,-2.3937496
GLQEFYEEMPISK,mox,M,266,true,"cat2 Methionine oxidation - 3h stress",62b,25693801,"MASCOT Score",66.0000000,,-0.1620407,,NO,,
KCPETSK,sno,C,285,true,"hot5-4 / wildtype, FAT-switch S-nitrosoproteome",169,37277371,,,,,,,,
KDDGNGSFGLFSLDGK,ph,S,349,true,"Tissue atlas Arabidopsis - ProteomicsDB",114,32188942,"MaxQuant score",79.2860000,1.0000000,,,,0.00024518801365048,
KDDGNGSFGLFSLDGK,ph,S,354,true,"Tissue atlas Arabidopsis - ProteomicsDB",114,32188942,"MaxQuant score",79.2860000,1.0000000,,,,0.00024518801365048,
LEGLCFVLK,ox,C,363,true,"SPEAR - 10 mM H2O2 / mock",138a,34619326,,,,-2.1269638,0.0018596,YES,,
LEGLCFVLK,ox,C,363,true,"SPEAR - 50 mM H2O2 / mock",138b,34619326,,,,-1.8455205,0.0035442,YES,,
STTPAFSEEGVLEAEADKPDIK,ph,T,467,true,"Tissue atlas Arabidopsis - ProteomicsDB",114,32188942,"MaxQuant score",75.6460000,0.7708890,,,,1.3188899856686E-6,
SEVNIDKSER,nt,S,834,true,"Arabidopsis translation initiation landscape - NT",167b,35069635,,,,,,,,
SEVNIDKSER,ac,K,840,true,"Histone deacetylases substrates - hda14 vs WT",98e,29061669,"MaxQuant Score",51.0000000,1.0000000,-0.3320000,0.8016781,NO,0.0080000003799796,
IGPGHYEPPNGSQNWSVAVEGRDYK,ng,N,867,true,"N-Glycopeptide Profiling in Arabidopsis Infloresce",132,27067053,"MOWSE score",15.6000000,,,,,0.01799999922514,
