Peptide,PTM,ModifiedAA,ModifiedPosition,PeptideUniqueToGene,ExperimentDesc,ExpID,PubmedID,ScoreType,IdentScore,LocProb,Log2FChange,PQ-val,QuantSig,PEP,MassErrorPPM
AGSEAVEDKE,nt,A,2,true,"N-terminal ChaFRADIC",92,26010716,"MASCOT Score",23.7000000,,,,,0.059349998831749,
AGSEAVEDKE,nta,A,2,true,"N-terminal ChaFRADIC",92,26010716,"MASCOT Score",23.7000000,,,,,0.059349998831749,
AGSEAVEDKE,nta,A,2,true,"Arabidopsis translation initiation landscape - NTA",167a,35069635,,,,,,,,
AGSEAVEDK,nta,A,2,true,"Characterization plant N-terminal acetylation",6,22223895,"MASCOT Score",61.0400000,,,,,,
AGSEAVEDKEIK,ph,S,4,true,"Tissue atlas Arabidopsis - ProteomicsDB",114,32188942,"MaxQuant score",160.4800000,1.0000000,,,,1.2552800465748E-10,
SAVSSCEAYFEK,ph,S,17,true,"Tissue atlas Arabidopsis - ProteomicsDB",114,32188942,"MaxQuant score",163.5100000,0.9814940,,,,2.6159599486597E-10,
SAVSSCEAYFEK,ph,S,18,true,"Tissue atlas Arabidopsis - ProteomicsDB",114,32188942,"MaxQuant score",128.5400000,0.9997220,,,,3.3386299037375E-5,
SAVSSCEAYFEK,sno,C,19,true,"Site-specific nitrosomeproteomic id - gsnor1-3",90b,25699590,XCorr,3.2000000,,,,,0.044339999556541,-6.8500000
SAVSSCEAYFEK,so,C,19,true,"S-sulfenylation site detection using YAP1C",110,32714340,,,,,,,,
NYVTQSAVVHGLEGCK,so,C,270,true,"Arabidopsis S-sulfenylation chemoproteomics",108,31578252,"pFind PSM Score",0.0000011,,1.5756300,,,,-0.3617578
NYVTQSAVVHGLEGCK,so,C,270,true,"S-sulfenylation site detection using YAP1C",110,32714340,,,,,,,,
IATAGEEYGLAIPAITCRPDSTLGSVINSLASR,so,C,381,true,"S-sulfenylation site detection using YAP1C",110,32714340,,,,,,,,
