Peptide,PTM,ModifiedAA,ModifiedPosition,PeptideUniqueToGene,ExperimentDesc,ExpID,PubmedID,ScoreType,IdentScore,LocProb,Log2FChange,PQ-val,QuantSig,PEP,MassErrorPPM
SEGELLPSPTLK,ph,S,59,true,"Tissue atlas Arabidopsis - ProteomicsDB",114,32188942,"MaxQuant score",66.7380000,1.0000000,,,,0.0054566599428654,
SEGELLPSPTLK,ph,S,66,true,"Tissue atlas Arabidopsis - ProteomicsDB",114,32188942,"MaxQuant score",172.3300000,0.9271700,,,,7.2643400558683E-15,
SLSPSKPGSGMVVAVK,ph,S,109,true,"Tissue atlas Arabidopsis - ProteomicsDB",114,32188942,"MaxQuant score",180.0200000,0.9683560,,,,3.8857599535812E-26,
SLSPSKPGSGMVVAVK,ph,S,115,true,"Tissue atlas Arabidopsis - ProteomicsDB",114,32188942,"MaxQuant score",184.6100000,0.9998670,,,,2.0171199539149E-26,
PDMADVLSTLQQLETSSK,ph,S,360,true,"Brassinosteroid-Regulated Phosphorylation Dynamics",94,26187819,"MaxQuant Score",60.4720000,0.7580000,,,,0.028999999165535,-0.3800000
PDMADVLSTLQQLETSSK,ph,T,367,true,"Brassinosteroid-Regulated Phosphorylation Dynamics",94,26187819,"MaxQuant Score",60.4720000,0.8360000,,,,0.028999999165535,-0.3800000
PDMADVLSTLQQLETSSK,ph,S,369,true,"Brassinosteroid-Regulated Phosphorylation Dynamics",94,26187819,"MaxQuant Score",60.4720000,0.7920000,,,,0.028999999165535,-0.3800000
MGSTQNIVMSPSSHMS,ph,S,381,true,"Tissue atlas Arabidopsis - ProteomicsDB",114,32188942,"MaxQuant score",234.3000000,0.9960660,,,,0,
