Peptide,PTM,ModifiedAA,ModifiedPosition,PeptideUniqueToGene,ExperimentDesc,ExpID,PubmedID,ScoreType,IdentScore,LocProb,Log2FChange,PQ-val,QuantSig,PEP,MassErrorPPM
DIKDGCGSATGGAK,ph,S,100,true,"Tissue atlas Arabidopsis - ProteomicsDB",114,32188942,"MaxQuant score",132.4000000,0.9688310,,,,5.7528301113052E-5,
SHDGTCVEDTENGSNK,ph,S,107,true,"Tissue atlas Arabidopsis - ProteomicsDB",114,32188942,"MaxQuant score",236.4300000,1.0000000,,,,0,
SHDGTCVEDTENGSNK,ph,S,120,true,"Tissue atlas Arabidopsis - ProteomicsDB",114,32188942,"MaxQuant score",135.4300000,0.9999730,,,,3.0476400070256E-8,
GAWCTPPR,acy,C,341,false,"Arabidopsis S-acylation atlas - Silique",163e,35681017,,,,,,,,
GAWCTPPR,acy,C,341,false,"Arabidopsis S-acylation atlas - Stem",163f,35681017,,,,,,,,
GAWCTPPR,ph,T,342,false,"atm and atr DNA damage response",88,25561503,"MASCOT Score",32.0000000,1.0000000,,,,,0.8400000
GAWCTPPR,ph,T,342,false,"Tissue atlas Arabidopsis - ProteomicsDB",114,32188942,"MaxQuant score",146.6900000,1.0000000,,,,0.0015619000187144,
ISPWTLAR,ph,S,385,true,"atm and atr DNA damage response",88,25561503,"MASCOT Score",32.0000000,1.0000000,,,,,-0.9400000
RENPFVGLEASSSFGSSGR,ph,S,429,true,"Tissue atlas Arabidopsis - ProteomicsDB",114,32188942,"MaxQuant score",230.2700000,0.8783940,,,,0,
AMSGSGNVMVTSSPESSLDSHDIHPFR,ph,S,504,true,"Tissue atlas Arabidopsis - ProteomicsDB",114,32188942,"MaxQuant score",148.9400000,0.9999270,,,,0,
AMSGSGNVMVTSSPESSLDSHDIHPFR,ph,S,514,true,"Tissue atlas Arabidopsis - ProteomicsDB",114,32188942,"MaxQuant score",75.3430000,0.8771010,,,,3.0293301200857E-10,
GQQQQQQLSMMMMPLSR,ph,S,569,true,"Tissue atlas Arabidopsis - ProteomicsDB",114,32188942,"MaxQuant score",238.1900000,1.0000000,,,,0,
STSDGYDASGGEDSDQVPSR,ph,S,571,true,"atm and atr DNA damage response",88,25561503,"MASCOT Score",37.0000000,0.7630000,,,,,-0.1300000
STSDGYDASGGEDSDQVPSR,ph,S,573,true,"Tissue atlas Arabidopsis - ProteomicsDB",114,32188942,"MaxQuant score",177.4100000,0.9307210,,,,1.5587999275598E-36,
STSDGYDASGGEDSDQVPSR,ph,Y,576,true,"atm and atr DNA damage response",88,25561503,"MASCOT Score",26.0000000,0.9060000,,,,,-0.4800000
STSDGYDASGGEDSDQVPSR,ph,S,579,true,"atm and atr DNA damage response",88,25561503,"MASCOT Score",37.0000000,1.0000000,,,,,-0.1300000
STSDGYDASGGEDSDQVPSR,ph,S,579,true,"Tissue atlas Arabidopsis - ProteomicsDB",114,32188942,"MaxQuant score",162.7200000,0.9995810,,,,3.8362499256487E-29,
