Peptide,PTM,ModifiedAA,ModifiedPosition,PeptideUniqueToGene,ExperimentDesc,ExpID,PubmedID,ScoreType,IdentScore,LocProb,Log2FChange,PQ-val,QuantSig,PEP,MassErrorPPM
SNSCVFPR,ph,S,16,true,"atm and atr DNA damage response",88,25561503,"MASCOT Score",36.0000000,1.0000000,,,,,0.2200000
SNSCVFPR,ph,S,16,true,"Tissue atlas Arabidopsis - ProteomicsDB",114,32188942,"MaxQuant score",196.5200000,1.0000000,,,,3.5565799194615E-9,
SSSVVVTMPLFR,ph,S,71,true,"TOR Kinase and ABA Receptor",100,29290610,XCorr,3.0825350,0.9037000,,,,2.4589999156888E-5,
SSSVVVTMPLFR,ph,S,71,true,"Tissue atlas Arabidopsis - ProteomicsDB",114,32188942,"MaxQuant score",172.1300000,0.9990540,,,,2.2473099109307E-15,
TTSLPAESEEEWRK,ph,S,115,true,"Tissue atlas Arabidopsis - ProteomicsDB",114,32188942,"MaxQuant score",205.8600000,0.9999540,,,,7.8304095757978E-39,
TTSLPAESEEEWRK,ph,S,120,true,"Brassinosteroid-Regulated Phosphorylation Dynamics",94,26187819,"MaxQuant Score",78.4410000,1.0000000,,,,0.041000001132488,-0.3040000
QHSAGLDSLQVSGESLGGGR,ph,S,194,true,"Tissue atlas Arabidopsis - ProteomicsDB",114,32188942,"MaxQuant score",157.6200000,1.0000000,,,,9.8938999492214E-29,
QHSAGLDSLQVSGESLGGGR,ph,S,199,true,"TOR Kinase and ABA Receptor",100,29290610,XCorr,2.9508998,0.8718000,,,,0.00081280001904815,
AAGSSSSVSELETK,ph,S,215,true,"Tissue atlas Arabidopsis - ProteomicsDB",114,32188942,"MaxQuant score",159.7500000,0.9939570,,,,1.1823700352132E-10,
AAGSSSSVSELETK,ph,S,216,true,"Tissue atlas Arabidopsis - ProteomicsDB",114,32188942,"MaxQuant score",178.0300000,0.9112380,,,,1.5486600484759E-22,
AAGSSSSVSELETK,ph,S,218,true,"Tissue atlas Arabidopsis - ProteomicsDB",114,32188942,"MaxQuant score",159.7500000,0.9899080,,,,1.1823700352132E-10,
SLPSTTQPQQETTTKPTNR,ph,S,233,true,"Tissue atlas Arabidopsis - ProteomicsDB",114,32188942,"MaxQuant score",85.9370000,0.9996760,,,,6.9956099650881E-6,
RLSSVDMNMK,ph,S,257,true,"atm and atr DNA damage response",88,25561503,"MASCOT Score",37.0000000,0.9780000,,,,,-0.8900000
LSSVDMNMK,ph,S,257,true,"Tissue atlas Arabidopsis - ProteomicsDB",114,32188942,"MaxQuant score",129.1600000,0.9999050,,,,0.00014059100067243,
HIVVNTSSPSNLL,ph,S,340,true,"Tissue atlas Arabidopsis - ProteomicsDB",114,32188942,"MaxQuant score",136.7000000,0.9223510,,,,3.2626499887556E-5,
