Peptide,PTM,ModifiedAA,ModifiedPosition,PeptideUniqueToGene,ExperimentDesc,ExpID,PubmedID,ScoreType,IdentScore,LocProb,Log2FChange,PQ-val,QuantSig,PEP,MassErrorPPM
MDHNSPKSR,nta,M,1,true,"Arg/N-end rule seed, prt6 vs. Wt",99,29168982,"MASCOT Score",35.2800000,,0.0519128,0.4475612,NO,0.15399999916553,-0.8779335
GDSDGEGEEDDDDDSMLPPLLK,ph,S,63,true,"atm and atr DNA damage response",88,25561503,"MASCOT Score",72.0000000,1.0000000,,,,,-0.2600000
GDSDGEGEEDDDDDSMLPPLLK,ph,S,63,true,"TOR Kinase and ABA Receptor",100,29290610,XCorr,4.5138869,1.0000000,,,,1.7160000425065E-6,
GDSDGEGEEDDDDDSMLPPLLK,ph,S,63,true,"Lateral root-induction - NAA vs control",106,23328941,"MASCOT Score",35.0000000,,,,,,
GDSDGEGEEDDDDDSMLPPLLK,ph,S,63,true,"Tissue atlas Arabidopsis - ProteomicsDB",114,32188942,"MaxQuant score",258.2700000,1.0000000,,,,0,
MGVSPR,ph,S,135,true,"TOR Kinase and ABA Receptor",100,29290610,XCorr,2.5175006,1.0000000,,,,0.014999999664724,
MGVSPR,ph,S,135,true,"Lateral root-induction - NAA vs control",106,23328941,"MASCOT Score",25.0000000,,,,,,
ARGGDEESSDEEDEEEDDDDDDGDYGTFVVK,ph,S,147,true,"srk2dei ABA signaling phopshoproteomics",83,23572148,"MASCOT Score",80.0000000,,,,,,-0.0056000
ARGGDEESSDEEDEEEDDDDDDGDYGTFVVK,ph,S,147,true,"SnRK2 protein kinase substrates",85,23776212,XCorr,5.5621762,0.8370000,,,,0.00013765699986834,
ARGGDEESSDEEDEEEDDDDDDGDYGTFVVK,ph,S,147,true,"TOR Kinase and ABA Receptor",100,29290610,XCorr,7.8398967,1.0000000,,,,1.257999997506E-7,
ARGGDEESSDEEDEEEDDDDDDGDYGTFVVK,ph,S,148,true,"srk2dei ABA signaling phopshoproteomics",83,23572148,"MASCOT Score",80.0000000,,,,,,-0.0056000
ARGGDEESSDEEDEEEDDDDDDGDYGTFVVK,ph,S,148,true,"TOR Kinase and ABA Receptor",100,29290610,XCorr,7.8398967,1.0000000,,,,1.257999997506E-7,
DKEIDMTTMGR,ph,T,187,true,"Tissue atlas Arabidopsis - ProteomicsDB",114,32188942,"MaxQuant score",103.6700000,0.8867040,,,,0.00030781299574301,
KLDPSSSSSK,ph,S,210,true,"atm and atr DNA damage response",88,25561503,"MASCOT Score",35.0000000,0.9930000,,,,,0.5900000
KLDPSSSSSK,ph,S,212,true,"atm and atr DNA damage response",88,25561503,"MASCOT Score",28.0000000,0.9860000,,,,,-0.6000000
MQQQNSKMSTTSLPDSITR,ph,S,229,true,"Tissue atlas Arabidopsis - ProteomicsDB",114,32188942,"MaxQuant score",51.4870000,0.8534130,,,,0.00088583002798259,
MSTTSLPDSITR,ph,S,232,true,"Tissue atlas Arabidopsis - ProteomicsDB",114,32188942,"MaxQuant score",117.0300000,0.9990030,,,,3.8949601730565E-5,
MSTTSLPDSITR,ph,T,234,true,"atm and atr DNA damage response",88,25561503,"MASCOT Score",47.0000000,0.9900000,,,,,-0.5400000
MSTTSLPDSITR,ph,T,234,true,"Tissue atlas Arabidopsis - ProteomicsDB",114,32188942,"MaxQuant score",222.7900000,0.9877940,,,,1.2488806316587E-39,
MSTTSLPDSITR,ph,S,235,true,"atm and atr DNA damage response",88,25561503,"MASCOT Score",49.0000000,1.0000000,,,,,0.1600000
MSTTSLPDSITR,ph,S,235,true,"TOR Kinase and ABA Receptor",100,29290610,XCorr,2.6715240,0.8535000,,,,0.015340000391006,
MSTTSLPDSITR,ph,S,235,true,"Lateral root-induction - NAA vs control",106,23328941,"MASCOT Score",40.0000000,,,,,,
MSTTSLPDSITR,ph,S,235,true,"Phospho cell culture sucrose/TOR",109,30833711,,,0.9480990,,,,,
MSTTSLPDSITR,ph,S,235,true,"Tissue atlas Arabidopsis - ProteomicsDB",114,32188942,"MaxQuant score",166.6200000,0.9992830,,,,1.4922499610233E-14,
MSTTSLPDSITR,ph,S,239,true,"atm and atr DNA damage response",88,25561503,"MASCOT Score",30.0000000,0.9950000,,,,,1.2600000
MSTTSLPDSITR,ph,S,239,true,"Tissue atlas Arabidopsis - ProteomicsDB",114,32188942,"MaxQuant score",104.9700000,0.9436940,,,,0.00019270800112281,
EKESSSSQFEGVPR,ph,S,618,true,"Tissue atlas Arabidopsis - ProteomicsDB",114,32188942,"MaxQuant score",150.1200000,0.9949740,,,,4.9178697736352E-7,
EKESSSSQFEGVPR,ph,S,619,true,"Tissue atlas Arabidopsis - ProteomicsDB",114,32188942,"MaxQuant score",201.1600000,0.9973470,,,,7.7940998647638E-33,
ESSSSQFEGVPR,ph,S,620,true,"Tissue atlas Arabidopsis - ProteomicsDB",114,32188942,"MaxQuant score",80.8710000,0.8175440,,,,0.001234219991602,
EKESSSSQFEGVPR,ph,S,621,true,"Tissue atlas Arabidopsis - ProteomicsDB",114,32188942,"MaxQuant score",130.0200000,0.9468220,,,,2.8435399144655E-5,
LHNIAGTQMEGGSDASGSTLK,ph,S,685,true,"Tissue atlas Arabidopsis - ProteomicsDB",114,32188942,"MaxQuant score",215.4000000,0.9839920,,,,0,
