Peptide,PTM,ModifiedAA,ModifiedPosition,PeptideUniqueToGene,ExperimentDesc,ExpID,PubmedID,ScoreType,IdentScore,LocProb,Log2FChange,PQ-val,QuantSig,PEP,MassErrorPPM
AAAASSDVEEVK,ph,S,130,true,"Tissue atlas Arabidopsis - ProteomicsDB",114,32188942,"MaxQuant score",152.4000000,0.9647950,,,,2.5362498945469E-7,
AAAASSDVEEVKTEK,ph,S,131,true,"Large-scale phosphorylation discovery",44,23111157,XCorr,3.7800000,,,,,,
AAAASSDVEEVKTEK,ph,S,131,true,"SnRK2 protein kinase substrates",85,23776212,XCorr,3.0862412,0.9970000,,,,5.6336699572057E-7,
AAAASSDVEEVKTEK,ph,S,131,true,"atm and atr DNA damage response",88,25561503,"MASCOT Score",44.0000000,0.9370000,,,,,-1.6900000
AAAASSDVEEVKTEK,ph,S,131,true,"Phospho cell culture sucrose/TOR",109,30833711,,,0.9994570,,,,,
AAAASSDVEEVKTEK,ph,S,131,true,"Tissue atlas Arabidopsis - ProteomicsDB",114,32188942,"MaxQuant score",264.0300000,0.9999790,,,,0,
AAAASSDVEEVK,ph,S,131,true,"srk2dei ABA signaling phopshoproteomics",83,23572148,"MASCOT Score",51.0000000,,,,,,-0.0001000
AAAASSDVEEVK,ph,S,131,true,"atm and atr DNA damage response",88,25561503,"MASCOT Score",65.0000000,0.9980000,,,,,-0.4700000
AAAASSDVEEVK,ph,S,131,true,"TOR Kinase and ABA Receptor",100,29290610,XCorr,4.1076355,0.9960000,,,,5.914000098528E-7,
RVTACSTMKISK,ph,T,305,true,"SIRK1 phosphorylation",86a,23820729,"MaxQuant Score",58.6370000,0.8910000,,,,1.2589999437332,6.9270000
RVTACSTMKISK,ph,T,305,true,"SIRK1 exp - sirk1 mutant vs WT",86b,23820729,,,,-0.1707411,,NO,,
RVTACSTMKISK,ph,T,305,true,"SIRK1 exp - 35S:SIRK1 vs WT",86c,23820729,,,,0.3594839,,NO,,
RVTACSTMKISK,ph,S,308,true,"SIRK1 phosphorylation",86a,23820729,"MaxQuant Score",76.5290000,0.8730000,,,,0.66299998760223,4.5110000
RVTACSTMKISK,ph,T,309,true,"SIRK1 phosphorylation",86a,23820729,"MaxQuant Score",88.4320000,0.9370000,,,,0.29100000858307,7.2160000
RVTACSTMKISK,ph,T,309,true,"SIRK1 exp - sirk1 mutant vs WT",86b,23820729,,,,-0.1707411,,NO,,
RVTACSTMKISK,ph,T,309,true,"SIRK1 exp - 35S:SIRK1 vs WT",86c,23820729,,,,0.3594839,,NO,,
