Peptide,PTM,ModifiedAA,ModifiedPosition,PeptideUniqueToGene,ExperimentDesc,ExpID,PubmedID,ScoreType,IdentScore,LocProb,Log2FChange,PQ-val,QuantSig,PEP,MassErrorPPM
GISSAESDKLSR,ph,S,15,true,"atm and atr DNA damage response",88,25561503,"MASCOT Score",30.0000000,1.0000000,,,,,-1.7200000
RISLDLPIR,ph,S,77,true,"Chloroplast kinase substrates",60,19376835,"MASCOT Score",31.6500000,,,,,,-0.0673596
RISLDLPIR,ph,S,77,true,"atm and atr DNA damage response",88,25561503,"MASCOT Score",41.0000000,1.0000000,,,,,0.0300000
RISLDLPIR,ph,S,77,true,"TOR Kinase and ABA Receptor",100,29290610,XCorr,3.5645404,1.0000000,,,,0.0003998999891337,
RISLDLPIR,ph,S,77,true,"Tissue atlas Arabidopsis - ProteomicsDB",114,32188942,"MaxQuant score",139.2900000,1.0000000,,,,6.7960696469527E-5,
RISLDLPIR,ph,S,77,true,"Touch-induced phosphorylation: 40s touch vs untouc",136,30291188,"MASCOT score",62.6100000,,0.0960810,0.3760113,NO,,8.8121610
SSISHFFSSSR,ph,S,170,true,"atm and atr DNA damage response",88,25561503,"MASCOT Score",40.0000000,0.9080000,,,,,0.5000000
SSISHFFSSSR,ph,S,170,true,"Tissue atlas Arabidopsis - ProteomicsDB",114,32188942,"MaxQuant score",101.3000000,0.8657520,,,,7.6004296715837E-5,
SLISSSSSGFRTPPPYLNTPTK,ph,T,207,true,"TOR Kinase and ABA Receptor",100,29290610,XCorr,2.8632820,0.9949000,,,,0.00014360000204761,
SLISSSSSGFRTPPPYLNTPTK,ph,T,207,true,"Tissue atlas Arabidopsis - ProteomicsDB",114,32188942,"MaxQuant score",113.9100000,0.9962040,,,,5.0403097867017E-16,
TPPPYLNTPTK,ph,T,214,true,"Tissue atlas Arabidopsis - ProteomicsDB",114,32188942,"MaxQuant score",92.0390000,0.9654980,,,,0.00082698097685352,
IWSDDEDIDDDRR,ph,S,264,true,"STN8 phosphoproteome",38,21768351,"MASCOT Score",49.6100000,,,,,,0.0387405
IWSDDEDIDDDRR,ph,S,264,true,"srk2dei ABA signaling phopshoproteomics",83,23572148,"MASCOT Score",62.0000000,,,,,,-0.0021000
IWSDDEDIDDDRR,ph,S,264,true,"SnRK2 protein kinase substrates",85,23776212,XCorr,3.5269086,1.0000000,,,,0.0060511701740324,
IWSDDEDIDDDRR,ph,S,264,true,"atm and atr DNA damage response",88,25561503,"MASCOT Score",56.0000000,1.0000000,,,,,-0.3000000
IWSDDEDIDDDRR,ph,S,264,true,"TOR Kinase and ABA Receptor",100,29290610,XCorr,2.4334159,1.0000000,,,,0.0089609995484352,
IWSDDEDIDDDRR,ph,S,264,true,"Tissue atlas Arabidopsis - ProteomicsDB",114,32188942,"MaxQuant score",232.5000000,1.0000000,,,,0,
IWSDDEDIDDDR,ph,S,264,true,"atm and atr DNA damage response",88,25561503,"MASCOT Score",69.0000000,1.0000000,,,,,-0.6100000
