Peptide,PTM,ModifiedAA,ModifiedPosition,PeptideUniqueToGene,ExperimentDesc,ExpID,PubmedID,ScoreType,IdentScore,LocProb,Log2FChange,PQ-val,QuantSig,PEP,MassErrorPPM
QKSPSHESPTR,ph,S,421,true,"atm and atr DNA damage response",88,25561503,"MASCOT Score",32.0000000,0.9940000,,,,,0.4900000
QKSPSHESPTR,ph,S,421,true,"Tissue atlas Arabidopsis - ProteomicsDB",114,32188942,"MaxQuant score",48.5270000,0.9554410,,,,0.0082993796095252,
QKSPSHESPTR,ph,S,426,true,"atm and atr DNA damage response",88,25561503,"MASCOT Score",29.0000000,1.0000000,,,,,-0.8000000
SPSHESPTR,ph,S,426,true,"atm and atr DNA damage response",88,25561503,"MASCOT Score",30.0000000,0.9510000,,,,,0.3700000
SKSFVNFGLVR,ph,S,440,true,"STN8 phosphoproteome",38,21768351,"MASCOT Score",43.9600000,,,,,,0.8163930
SKSFVNFGLVR,ph,S,440,true,"Phosphoproteome iron-deficient Arabidopsis roots",41,22438062,"MASCOT Score",38.5500000,,,,,,
SKSFVNFGLVR,ph,S,440,true,"atm and atr DNA damage response",88,25561503,"MASCOT Score",44.0000000,0.9950000,,,,,-1.4800000
SKSFVNFGLVR,ph,S,440,true,"Tissue atlas Arabidopsis - ProteomicsDB",114,32188942,"MaxQuant score",170.8900000,0.9999970,,,,2.3663699472154E-11,
SFVNFGLVR,ph,S,440,true,"srk2dei ABA signaling phopshoproteomics",83,23572148,"MASCOT Score",65.0000000,,,,,,0.0004000
SFVNFGLVR,ph,S,440,true,"atm and atr DNA damage response",88,25561503,"MASCOT Score",45.0000000,1.0000000,,,,,-0.0100000
SFVNFGLVR,ph,S,440,true,"TOR Kinase and ABA Receptor",100,29290610,XCorr,3.8205657,1.0000000,,,,1.1719999747584E-5,
SFVNFGLVR,ph,S,440,true,"Phospho cell culture sucrose/TOR",109,30833711,,,1.0000000,,,,,
