Peptide,PTM,ModifiedAA,ModifiedPosition,PeptideUniqueToGene,ExperimentDesc,ExpID,PubmedID,ScoreType,IdentScore,LocProb,Log2FChange,PQ-val,QuantSig,PEP,MassErrorPPM
TGKGNQEEEDYGEEDFNSKR,ub,K,21,true,"Arabidopsis ubiquitination COFRADIC",40,26744219,"MaxQuant Score",119.3800000,1.0000000,,,,0,0.0260000
EGPSSNTTVHSNR,ph,S,26,true,"atm and atr DNA damage response",88,25561503,"MASCOT Score",39.0000000,0.9930000,,,,,-0.1900000
EGPSSNTTVHSNR,ph,S,27,true,"Tissue atlas Arabidopsis - ProteomicsDB",114,32188942,"MaxQuant score",47.2230000,0.8179830,,,,0.0080388002097607,
ELIPNSEQKR,ub,K,78,true,"Arabidopsis ubiquitination COFRADIC",40,26744219,"MaxQuant Score",105.9800000,1.0000000,,,,3.9700000343146E-5,0.3730000
AITGISIESQPELDDK,ph,S,184,true,"Col-0 callus - FC Col-0 vs. Col-0 Xray",111a,31410901,,73.7700000,,5.8681995,0.0017568,YES,,1.1337687
AITGISIESQPELDDK,ph,S,184,true,"Col-0 X-ray callus - FC Col-0 vs. Col-0 Xray",111b,31410901,,73.7700000,,5.8681995,0.0017568,YES,,1.1337687
AITGISIESQPELDDK,ph,S,184,true,"atm callus - FC atm vs. atm Xray",111c,31410901,,73.7700000,,-0.9426935,0.3383687,NO,,1.1337687
AITGISIESQPELDDK,ph,S,184,true,"atm-3 X-ray callus - FC atm vs. atm Xray",111d,31410901,,73.7700000,,-0.9426935,0.3383687,NO,,1.1337687
AITGISIESQPELDDK,ph,S,184,true,"Tissue atlas Arabidopsis - ProteomicsDB",114,32188942,"MaxQuant score",111.7000000,0.9998810,,,,2.2863700621656E-7,
NPLSYDTQGRDSSVEEESEHSHK,ph,S,287,true,"TOR Kinase and ABA Receptor",100,29290610,XCorr,4.4815197,0.9157000,,,,0.0013770000077784,
NPLSYDTQGR,ph,S,287,true,"Tissue atlas Arabidopsis - ProteomicsDB",114,32188942,"MaxQuant score",145.0100000,0.9999900,,,,6.7038098450212E-7,
NPLSYDTQGRDSSVEEESEHSHK,ph,T,290,true,"atm and atr DNA damage response",88,25561503,"MASCOT Score",25.0000000,0.9890000,,,,,-0.0300000
NPLSYDTQGRDSSVEEESEHSHK,ph,T,290,true,"Phospho cell culture sucrose/TOR",109,30833711,,,0.7761740,,,,,
NPLSYDTQGRDSSVEEESEHSHKR,ph,S,295,true,"Phospho cell culture sucrose/TOR",109,30833711,,,0.9299050,,,,,
NPLSYDTQGRDSSVEEESEHSHKR,ph,S,295,true,"Tissue atlas Arabidopsis - ProteomicsDB",114,32188942,"MaxQuant score",148.1900000,0.9949700,,,,1.7936620343358E-43,
NPLSYDTQGRDSSVEEESEHSHK,ph,S,295,true,"atm and atr DNA damage response",88,25561503,"MASCOT Score",35.0000000,1.0000000,,,,,0.1500000
NPLSYDTQGRDSSVEEESEHSHK,ph,S,296,true,"atm and atr DNA damage response",88,25561503,"MASCOT Score",35.0000000,1.0000000,,,,,0.1500000
DSSVEEESEHSHKR,ph,S,296,true,"Tissue atlas Arabidopsis - ProteomicsDB",114,32188942,"MaxQuant score",148.1900000,0.9999770,,,,1.7936620343358E-43,
