Peptide,PTM,ModifiedAA,ModifiedPosition,PeptideUniqueToGene,ExperimentDesc,ExpID,PubmedID,ScoreType,IdentScore,LocProb,Log2FChange,PQ-val,QuantSig,PEP,MassErrorPPM
VGVGLPCTVMECGDMIYR,nt,V,59,true,"N-terminal ChaFRADIC",92,26010716,"MASCOT Score",81.7500000,,,,,1.3219999539515E-9,
VGVGLPCTVMECGDMIYR,nt,V,59,true,"HUNTER N-terminome: legumain, GluC and trypsin",119,31951383,"MaxQuant score",62.1400000,,,,,,
VGVGLPCTVME,nt,V,59,true,"N-terminal ChaFRADIC",92,26010716,"MASCOT Score",62.5300000,,,,,3.8119999317132E-6,
VGVGLPCTVME,nt,V,59,true,"HUNTER N-terminome: legumain, GluC and trypsin",119,31951383,"MaxQuant score",124.0800000,,,,,,
KDDFVVGKK,ac,K,138,true,"Quantitative Acetylproteomics",101,29440448,,,,,,,,
SNEEGEYVLKK,ac,K,167,true,"Quantitative Acetylproteomics",101,29440448,,,,,,,,
QLLFALDGLHSTGIIHR,nt,Q,262,true,"HUNTER N-terminome: legumain, GluC and trypsin",119,31951383,"MaxQuant score",71.0850000,,,,,,
SDSNLIQFNR,ph,S,380,true,"atm and atr DNA damage response",88,25561503,"MASCOT Score",49.0000000,1.0000000,,,,,-0.7900000
CDYDLTAWR,sno,C,392,true,"hot5-4 / wildtype, FAT-switch S-nitrosoproteome",169,37277371,,,,,,,,
RCDYDLTAWR,so,C,392,true,"Arabidopsis S-sulfenylation chemoproteomics",108,31578252,"pFind PSM Score",0.0870721,,0.8403400,,,,-1.9944986
NGTEKDGGFTETQLQELR,ph,T,494,true,"Tissue atlas Arabidopsis - ProteomicsDB",114,32188942,"MaxQuant score",78.4280000,0.9919850,,,,0.00011325500236126,
NALASALR,ph,S,526,true,"STN8 phosphoproteome",38,21768351,"MASCOT Score",54.6800000,,,,,,-0.4856760
NALASALR,ph,S,526,true,"Phosphoproteome ethylene-regulated time response",46,24043427,"MASCOT Score",39.2100000,,,,,,-11.3387000
NALASALR,ph,S,526,true,"Chloroplast kinase substrates",60,19376835,"MASCOT Score",53.0200000,,,,,,-0.4856760
NALASALR,ph,S,526,true,"atm and atr DNA damage response",88,25561503,"MASCOT Score",44.0000000,1.0000000,,,,,-0.1400000
NALASALR,ph,S,526,true,"TOR Kinase and ABA Receptor",100,29290610,XCorr,2.3685966,1.0000000,,,,0.00058870000066236,
NALASALR,ph,S,526,true,"Tissue atlas Arabidopsis - ProteomicsDB",114,32188942,"MaxQuant score",133.7600000,1.0000000,,,,0.00272864010185,
LVKTVTETIDEISDGRK,ph,T,537,true,"STN8 phosphoproteome",38,21768351,"MASCOT Score",57.1000000,,,,,,
LVKTVTETIDEISDGRK,ph,T,537,true,"Phosphoproteome ethylene-regulated time response",46,24043427,"MASCOT Score",63.0700000,,,,,,-2.5931000
LVKTVTETIDEISDGRK,ph,T,537,true,"Chloroplast kinase substrates",60,19376835,"MASCOT Score",45.5900000,,,,,,-0.2199950
LVKTVTETIDEISDGRK,ph,T,537,true,"atm and atr DNA damage response",88,25561503,"MASCOT Score",27.0000000,1.0000000,,,,,-1.1100000
LVKTVTETIDEISDGRK,ph,T,537,true,"Brassinosteroid-Regulated Phosphorylation Dynamics",94,26187819,"MaxQuant Score",113.5400000,1.0000000,,,,5.9950001741527E-5,1.7570000
LVKTVTETIDEISDGRK,ph,T,537,true,"TOR Kinase and ABA Receptor",100,29290610,XCorr,4.2549753,0.9982000,,,,0.0013960000360385,
LVKTVTETIDEISDGRK,ph,T,537,true,"Touch-induced phosphorylation: 40s touch vs untouc",136,30291188,"MASCOT score",81.6900000,,0.0370667,0.7648998,NO,,3.9350506
KLVKTVTETIDEISDGR,ph,T,537,true,"STN8 phosphoproteome",38,21768351,"MASCOT Score",48.5400000,,,,,,
KLVKTVTETIDEISDGR,ph,T,537,true,"Large-scale phosphorylation discovery",44,23111157,XCorr,3.7530000,,,,,,
KLVKTVTETIDEISDGR,ph,T,537,true,"Phosphoproteome ethylene-regulated time response",46,24043427,"MASCOT Score",55.0700000,,,,,,-3.5562000
KLVKTVTETIDEISDGR,ph,T,537,true,"Touch-induced phosphorylation: 40s touch vs untouc",136,30291188,"MASCOT score",108.7900000,,-0.0496219,0.6976121,NO,,1.1272504
LVKTVTETIDEISDGR,ph,T,537,true,"STN8 phosphoproteome",38,21768351,"MASCOT Score",46.8100000,,,,,,
LVKTVTETIDEISDGR,ph,T,537,true,"Large-scale phosphorylation discovery",44,23111157,XCorr,5.0870000,,,,,,
LVKTVTETIDEISDGR,ph,T,537,true,"atm and atr DNA damage response",88,25561503,"MASCOT Score",59.0000000,0.9990000,,,,,-0.2900000
LVKTVTETIDEISDGR,ph,T,537,true,"Phospho cell culture sucrose/TOR",109,30833711,,,0.9999460,,,,,
LVKTVTETIDEISDGR,ph,T,537,true,"Tissue atlas Arabidopsis - ProteomicsDB",114,32188942,"MaxQuant score",295.8600000,1.0000000,,,,0,
LVKTVTETIDEISDGR,ph,T,537,true,"Touch-induced phosphorylation: 40s touch vs untouc",136,30291188,"MASCOT score",89.1300000,,-0.2233411,0.3976989,NO,,4.2884088
TVTETIDEISDGRK,ph,T,537,true,"STN8 phosphoproteome",38,21768351,"MASCOT Score",43.5500000,,,,,,
TVTETIDEISDGRK,ph,T,537,true,"Large-scale phosphorylation discovery",44,23111157,XCorr,3.9930000,,,,,,
TVTETIDEISDGRK,ph,T,537,true,"atm and atr DNA damage response",88,25561503,"MASCOT Score",68.0000000,1.0000000,,,,,-0.8100000
TVTETIDEISDGRK,ph,T,537,true,"TOR Kinase and ABA Receptor",100,29290610,XCorr,4.4492989,0.9182000,,,,0.00020049999875482,
TVTETIDEISDGRK,ph,T,537,true,"Touch-induced phosphorylation: 40s touch vs untouc",136,30291188,"MASCOT score",68.5100000,,0.0657228,0.8049565,NO,,2.6462713
TVTETIDEISDGR,ph,T,537,true,"atm and atr DNA damage response",88,25561503,"MASCOT Score",78.0000000,1.0000000,,,,,-0.1500000
LVKTVTETIDEISDGRK,ph,T,539,true,"Phosphoproteome ethylene-regulated time response",46,24043427,"MASCOT Score",50.6700000,,,,,,-12.1769000
LVKTVTETIDEISDGRK,ph,T,539,true,"Brassinosteroid-Regulated Phosphorylation Dynamics",94,26187819,"MaxQuant Score",113.5400000,0.8770000,,,,0.014000000432134,1.0370000
TVTETIDEISDGRK,ph,T,539,true,"Large-scale phosphorylation discovery",44,23111157,XCorr,4.4080000,,,,,,
TVTETIDEISDGRK,ph,T,539,true,"Chloroplast kinase substrates",60,19376835,"MASCOT Score",39.5000000,,,,,,-0.8842520
TVTETIDEISDGRK,ph,T,539,true,"atm and atr DNA damage response",88,25561503,"MASCOT Score",30.0000000,0.9340000,,,,,-1.3500000
TVTETIDEISDGRK,ph,T,539,true,"Phospho cell culture sucrose/TOR",109,30833711,,,0.8317640,,,,,
TVTETIDEISDGRK,ph,T,539,true,"Tissue atlas Arabidopsis - ProteomicsDB",114,32188942,"MaxQuant score",133.3800000,0.9524440,,,,2.6523199192496E-9,
TVTETIDEISDGR,ph,T,539,true,"atm and atr DNA damage response",88,25561503,"MASCOT Score",69.0000000,1.0000000,,,,,-0.5700000
TVTETIDEISDGRKTVWWNR,ph,T,541,true,"STN8 phosphoproteome",38,21768351,"MASCOT Score",46.0700000,,,,,,
LVKTVTETIDEISDGRK,ph,T,541,true,"Phosphoproteome ethylene-regulated time response",46,24043427,"MASCOT Score",63.0700000,,,,,,-2.5931000
LVKTVTETIDEISDGRK,ph,T,541,true,"Chloroplast kinase substrates",60,19376835,"MASCOT Score",38.3400000,,,,,,-0.2932810
LVKTVTETIDEISDGRK,ph,T,541,true,"atm and atr DNA damage response",88,25561503,"MASCOT Score",27.0000000,0.9940000,,,,,-1.1100000
LVKTVTETIDEISDGRK,ph,T,541,true,"Brassinosteroid-Regulated Phosphorylation Dynamics",94,26187819,"MaxQuant Score",106.4200000,0.8120000,,,,5.9950001741527E-5,-5.2460000
LVKTVTETIDEISDGRK,ph,T,541,true,"TOR Kinase and ABA Receptor",100,29290610,XCorr,4.2549753,0.9863000,,,,0.0013960000360385,
LVKTVTETIDEISDGRK,ph,T,541,true,"Touch-induced phosphorylation: 40s touch vs untouc",136,30291188,"MASCOT score",81.6900000,,0.0370667,0.7648998,NO,,3.9350506
KLVKTVTETIDEISDGR,ph,T,541,true,"Phosphoproteome ethylene-regulated time response",46,24043427,"MASCOT Score",55.0700000,,,,,,-3.5562000
KLVKTVTETIDEISDGR,ph,T,541,true,"Touch-induced phosphorylation: 40s touch vs untouc",136,30291188,"MASCOT score",108.7900000,,-0.0496219,0.6976121,NO,,1.1272504
LVKTVTETIDEISDGR,ph,T,541,true,"atm and atr DNA damage response",88,25561503,"MASCOT Score",59.0000000,0.9930000,,,,,-0.2900000
LVKTVTETIDEISDGR,ph,T,541,true,"Touch-induced phosphorylation: 40s touch vs untouc",136,30291188,"MASCOT score",89.1300000,,-0.2233411,0.3976989,NO,,4.2884088
TVTETIDEISDGRK,ph,T,541,true,"STN8 phosphoproteome",38,21768351,"MASCOT Score",53.6900000,,,,,,-0.9466190
TVTETIDEISDGRK,ph,T,541,true,"atm and atr DNA damage response",88,25561503,"MASCOT Score",75.0000000,1.0000000,,,,,0.0000000
TVTETIDEISDGRK,ph,T,541,true,"TOR Kinase and ABA Receptor",100,29290610,XCorr,4.4492989,0.9182000,,,,0.00020049999875482,
TVTETIDEISDGRK,ph,T,541,true,"Phospho cell culture sucrose/TOR",109,30833711,,,0.9999990,,,,,
TVTETIDEISDGRK,ph,T,541,true,"Tissue atlas Arabidopsis - ProteomicsDB",114,32188942,"MaxQuant score",287.9600000,1.0000000,,,,0,
TVTETIDEISDGRK,ph,T,541,true,"Touch-induced phosphorylation: 40s touch vs untouc",136,30291188,"MASCOT score",68.5100000,,0.0657228,0.8049565,NO,,2.6462713
TVTETIDEISDGR,ph,T,541,true,"atm and atr DNA damage response",88,25561503,"MASCOT Score",84.0000000,1.0000000,,,,,-0.3600000
TVTETIDEISDGRK,ph,S,546,true,"atm and atr DNA damage response",88,25561503,"MASCOT Score",34.0000000,1.0000000,,,,,0.0100000
TVTETIDEISDGRKTVWWNR,ph,T,551,true,"Phospho cell culture sucrose/TOR",109,30833711,,,0.9436260,,,,,
KTVWWNR,ph,T,551,true,"Tissue atlas Arabidopsis - ProteomicsDB",114,32188942,"MaxQuant score",110.8300000,1.0000000,,,,6.5711797982149E-12,
TVWWNR,ph,T,551,true,"Touch-induced phosphorylation: 40s touch vs untouc",136,30291188,"MASCOT score",33.7500000,,-0.1213563,0.5729316,NO,,13.8911896
