Peptide,PTM,ModifiedAA,ModifiedPosition,PeptideUniqueToGene,ExperimentDesc,ExpID,PubmedID,ScoreType,IdentScore,LocProb,Log2FChange,PQ-val,QuantSig,PEP,MassErrorPPM
YKTIGKGYR,nt,Y,28,true,"Metacaspase9 substrates - 35S:MC9 / mc9",51b,23964026,"MASCOT Score",51.0000000,,1.1257408,,NO,,-0.6887212
YKTIGKGYR,nt,Y,28,true,"Arabidopsis translation initiation landscape - NT",167b,35069635,,,,,,,,
LFVKHETDSR,ac,K,73,true,"Quantitative Acetylproteomics",101,29440448,,,,,,,,
ISGSELIFSYTTDPFTFAVKR,nt,I,124,true,"FtsH12 N-terminome: WT / FtsH12 knockdown miRNA",118,33216923,"MaxQuant score",91.0760000,,,,,9.5400000203705E-20,
ISGSELIFSYTTDPFTFAVKR,nt,I,124,true,"HUNTER N-terminome: legumain, GluC and trypsin",119,31951383,"MaxQuant score",93.9200000,,,,,,
SNHETLFNTTSSLVFKDQYLEISTSLPK,ng,N,153,true,"Conserved N-glycosylation",74,22633491,"MaxQuant Score",267.7200000,1.0000000,,,,0,0.3160000
SNHETLFNTTSSLVFK,ng,N,153,true,"N-linked Glycan Micro-heterogeneity Arabidopsis",134,29237727,,,,,,,,
SNHETLFNTTSSLVFK,ng,N,153,true,"UDP-GlcNAc transporter glycopeptide analysis",135,30224661,,,,,,,5.5484411377186E-19,0.3000000
WGYHNLSVVEDVVDNYKK,ng,N,304,true,"Conserved N-glycosylation",74,22633491,"MaxQuant Score",251.8800000,1.0000000,,,,0,1.1720000
WGYHNLSVVEDVVDNYKK,ng,N,304,true,"N-Glycopeptide Profiling in Arabidopsis Infloresce",132,27067053,"MOWSE score",28.4000000,,,,,0.0099999997764826,
WGYHNLSVVEDVVDNYKK,ng,N,304,true,"UDP-GlcNAc transporter glycopeptide analysis",135,30224661,,,,,,,7.485513381528E-16,0.2000000
WGYHNLSVVEDVVDNYK,ng,N,304,true,"N-linked Glycan Micro-heterogeneity Arabidopsis",134,29237727,,,,,,,,
WGYHNLSVVEDVVDNYK,ng,N,304,true,"UDP-GlcNAc transporter glycopeptide analysis",135,30224661,,,,,,,4.4314345331029E-19,0.6000000
YIVINDPGIGVNASYGTFQR,ng,N,375,true,"Conserved N-glycosylation",74,22633491,"MaxQuant Score",225.3400000,1.0000000,,,,0,0.2050000
YIVINDPGIGVNASYGTFQR,ng,N,375,true,"N-glycan occupancy Arabidopsis glycoproteins",87,23994444,"Ladder score",69.2000000,,,,,,
YIVINDPGIGVNASYGTFQR,ng,N,375,true,"N-linked Glycan Micro-heterogeneity Arabidopsis",134,29237727,,,,,,,,
YIVINDPGIGVNASYGTFQR,ng,N,375,true,"UDP-GlcNAc transporter glycopeptide analysis",135,30224661,,,,,,,3.3067941267681E-17,0.6000000
TVSWWGDEIKR,ac,K,426,true,"Quantitative Acetylproteomics",101,29440448,,,,,,,,
QCPSGEGPGWVCCLDCKNITK,ng,N,476,true,"Conserved N-glycosylation",74,22633491,"MaxQuant Score",133.0200000,1.0000000,,,,2.0939999658597E-20,0.2400000
TRWDDPPYKINATGVVAPVGFK,ng,N,490,true,"N-Glycopeptide Profiling in Arabidopsis Infloresce",132,27067053,"MOWSE score",39.0000000,,,,,5.6000000768108E-5,
TRWDDPPYKINATGVVAPVGFK,ng,N,490,true,"UDP-GlcNAc transporter glycopeptide analysis",135,30224661,,,,,,,2.4477527209993E-12,0.9000000
WDDPPYKINATGVVAPVGFK,ng,N,490,true,"Conserved N-glycosylation",74,22633491,"MaxQuant Score",183.8500000,1.0000000,,,,0,0.4740000
WDDPPYKINATGVVAPVGFK,ng,N,490,true,"UDP-GlcNAc transporter glycopeptide analysis",135,30224661,,,,,,,3.9011320215887E-12,1.3000000
PPYKINATGVVAPVGFK,ng,N,490,true,"N-glycan occupancy Arabidopsis glycoproteins",87,23994444,"Ladder score",53.5000000,,,,,,
INATGVVAPVGFK,ng,N,490,true,"N-glycan occupancy Arabidopsis glycoproteins",87,23994444,"Ladder score",81.3000000,,,,,,
INATGVVAPVGFK,ng,N,490,true,"N-linked Glycan Micro-heterogeneity Arabidopsis",134,29237727,,,,,,,,
INATGVVAPVGFK,ng,N,490,true,"UDP-GlcNAc transporter glycopeptide analysis",135,30224661,,,,,,,3.6637666332678E-16,0.7000000
GFYPQPTEE,nt,G,595,true,"Arg/N-end rule seed, prt6 vs. Wt",99,29168982,"MASCOT Score",26.1900000,,-0.6425821,0.0092583,NO,0.050159998238087,-1.7534641
QELYQWDTVADSAR,nt,Q,629,true,"HUNTER N-terminome: legumain, GluC and trypsin",119,31951383,"MaxQuant score",127.3700000,,,,,,
NYEAHMTGAPIAR,nt,N,659,true,"FtsH12 N-terminome: WT / FtsH12 knockdown miRNA",118,33216923,"MaxQuant score",95.5020000,,,,,7.469999973099E-16,
YEAHMTGAPIAR,nta,Y,660,true,"FtsH12 N-terminome: WT / FtsH12 knockdown miRNA",118,33216923,"MaxQuant score",88.6810000,,,,,0.0050066001713276,
SSFMISPVLE,nt,S,694,true,"Arg/N-end rule seed, prt6 vs. Wt",99,29168982,"MASCOT Score",40.8200000,,-0.8962578,0.1757433,NO,0.02879000082612,1.8129795
LGNGQSTYVDFYASVGNGTMK,ng,N,819,true,"Conserved N-glycosylation",74,22633491,"MaxQuant Score",161.0300000,1.0000000,,,,1.4012984643248E-45,-2.0490000
LGNGQSTYVDFYASVGNGTMK,ng,N,819,true,"N-linked Glycan Micro-heterogeneity Arabidopsis",134,29237727,,,,,,,,
LGNGQSTYVDFYASVGNGTMK,ng,N,819,true,"UDP-GlcNAc transporter glycopeptide analysis",135,30224661,,,,,,,0.0030759808141738,0.0000000
DEEENKSVMVEVR,nt,D,884,true,"Arg/N-end rule seed, prt6 vs. Wt",99,29168982,"MASCOT Score",26.5300000,,-1.0808352,0.0085144,YES,0.00088290002895519,-1.7357884
DEEENKSVMVEVR,nt,D,884,true,"Arabidopsis translation initiation landscape - NT",167b,35069635,,,,,,,,
GLEMLVGKDFNMSWK,ng,N,907,true,"Conserved N-glycosylation",74,22633491,"MaxQuant Score",92.6560000,1.0000000,,,,4.3209998693783E-5,-1.1830000
