Peptide,PTM,ModifiedAA,ModifiedPosition,PeptideUniqueToGene,ExperimentDesc,ExpID,PubmedID,ScoreType,IdentScore,LocProb,Log2FChange,PQ-val,QuantSig,PEP,MassErrorPPM
AIDVCCSEASGSGISPR,ph,S,16,true,"Tissue atlas Arabidopsis - ProteomicsDB",114,32188942,"MaxQuant score",156.1300000,0.9921810,,,,1.9418000028722E-16,
SASLSSSSSSSSSSSSSSRAPEKK,fuc,S,93,true,"SPINDLY O-fucosylation",162,36739885,,,,,,,-1.2000000476837,
SASLSSSSSSSSSSSSSSR,ph,S,95,true,"Tissue atlas Arabidopsis - ProteomicsDB",114,32188942,"MaxQuant score",133.9400000,0.9917800,,,,3.5106400700027E-15,
SASLSSSSSSSSSSSSSSRAPEKK,fuc,S,103,true,"SPINDLY O-fucosylation",162,36739885,,,,,,,-0.30000001192093,
SISLNYDK,ph,S,146,true,"atm and atr DNA damage response",88,25561503,"MASCOT Score",39.0000000,1.0000000,,,,,-0.9800000
SISLNYDK,ph,S,146,true,"Tissue atlas Arabidopsis - ProteomicsDB",114,32188942,"MaxQuant score",89.0320000,0.9999820,,,,0.0070349401794374,
SNSTPNPNLDLLPK,ph,S,168,true,"atm and atr DNA damage response",88,25561503,"MASCOT Score",33.0000000,0.9960000,,,,,0.1300000
SNSTPNPNLDLLPK,ph,S,170,true,"Tissue atlas Arabidopsis - ProteomicsDB",114,32188942,"MaxQuant score",136.3900000,0.9749160,,,,1.8869499399443E-5,
SSSLSSSSVPFYSK,ph,S,204,true,"Tissue atlas Arabidopsis - ProteomicsDB",114,32188942,"MaxQuant score",159.1200000,0.9987790,,,,3.3786899059779E-12,
