Peptide,PTM,ModifiedAA,ModifiedPosition,PeptideUniqueToGene,ExperimentDesc,ExpID,PubmedID,ScoreType,IdentScore,LocProb,Log2FChange,PQ-val,QuantSig,PEP,MassErrorPPM
RRPVRPSFDAAADNEFITLLHGSDPVK,ph,S,49,true,"Arabidopsis root NAA phosphoproteome",18a,27643528,"MaxQuant Score",59.8180000,1.0000000,,,,8.6419995568576E-6,0.2740000
RRPVRPSFDAAADNEFITLLHGSDPVK,ph,S,49,true,"TOR Kinase and ABA Receptor",100,29290610,XCorr,4.5092821,1.0000000,,,,4.8430001697852E-7,
RPVRPSFDAAADNEFITLLHGSDPVK,ph,S,49,true,"TOR Kinase and ABA Receptor",100,29290610,XCorr,4.8422484,1.0000000,,,,6.3670000827187E-7,
RPVRPSFDAAADNEFITLLHGSDPVK,ph,S,49,true,"Tissue atlas Arabidopsis - ProteomicsDB",114,32188942,"MaxQuant score",321.3000000,1.0000000,,,,0,
ELSEANAEIKALR,ub,K,94,true,"Arabidopsis ubiquitination COFRADIC",40,26744219,"MaxQuant Score",67.9970000,1.0000000,,,,5.1899998652516E-5,0.2040000
SEIGKLQEDNR,ub,K,191,false,"Arabidopsis ubiquitination COFRADIC",40,26744219,"MaxQuant Score",50.3540000,1.0000000,,,,0.0070000002160668,-0.7330000
LTKSKEAALLDAER,ub,K,206,false,"Arabidopsis ubiquitination COFRADIC",40,26744219,"MaxQuant Score",107.5000000,1.0000000,,,,4.8240000183461E-15,-0.3360000
KFQEMNEER,ub,K,292,false,"Arabidopsis ubiquitination COFRADIC",40,26744219,"MaxQuant Score",110.3900000,1.0000000,,,,0.00034400000004098,0.0550000
DKLAISDR,ub,K,355,true,"Arabidopsis ubiquitination COFRADIC",40,26744219,"MaxQuant Score",103.1900000,1.0000000,,,,0.013000000268221,-0.4040000
RQSIGGSDNLQK,ph,S,410,true,"atm and atr DNA damage response",88,25561503,"MASCOT Score",65.0000000,1.0000000,,,,,-0.9000000
RQSIGGSDNLQK,ph,S,410,true,"Protein sumoylation and phosphorylation cross-talk",97,28419593,,,,,,,,
RQSIGGSDNLQK,ph,S,410,true,"Phospho cell culture sucrose/TOR",109,30833711,,,0.9998960,,,,,
RQSIGGSDNLQK,ph,S,410,true,"Tissue atlas Arabidopsis - ProteomicsDB",114,32188942,"MaxQuant score",197.9300000,1.0000000,,,,7.5453998312137E-25,
RQSIGGSDNLQK,ph,S,414,true,"atm and atr DNA damage response",88,25561503,"MASCOT Score",43.0000000,1.0000000,,,,,-1.5900000
RQSIGGSDNLQK,ph,S,414,true,"TOR Kinase and ABA Receptor",100,29290610,XCorr,4.2030368,0.8968000,,,,0.00018689999706112,
FASNGFLSK,ph,S,422,true,"atm and atr DNA damage response",88,25561503,"MASCOT Score",46.0000000,1.0000000,,,,,-2.0300000
FASNGFLSK,ph,S,422,true,"Tissue atlas Arabidopsis - ProteomicsDB",114,32188942,"MaxQuant score",186.7400000,1.0000000,,,,3.0863000688441E-7,
FASNGFLSK,ph,S,427,true,"Tissue atlas Arabidopsis - ProteomicsDB",114,32188942,"MaxQuant score",90.9130000,0.9998560,,,,0.0022450699470937,
TPMRNSFTSNSTSVLK,ph,S,435,true,"TOR Kinase and ABA Receptor",100,29290610,XCorr,4.3051004,0.9874000,,,,7.6709999120794E-5,
NSFTSNSTSVLK,ph,S,435,true,"SnRK2 protein kinase substrates",85,23776212,XCorr,2.6220138,0.9990000,,,,0.02247910015285,
NSFTSNSTSVLK,ph,S,435,true,"atm and atr DNA damage response",88,25561503,"MASCOT Score",77.0000000,1.0000000,,,,,-0.4400000
NSFTSNSTSVLK,ph,S,435,true,"Phospho cell culture sucrose/TOR",109,30833711,,,0.9977650,,,,,
NSFTSNSTSVLK,ph,S,435,true,"Tissue atlas Arabidopsis - ProteomicsDB",114,32188942,"MaxQuant score",218.3400000,0.9999980,,,,4.4312504636173E-39,
NSFTSNSTSVLK,ph,T,437,true,"atm and atr DNA damage response",88,25561503,"MASCOT Score",26.0000000,0.9540000,,,,,0.1400000
GTSKSFDGGTR,ph,S,453,false,"atm and atr DNA damage response",88,25561503,"MASCOT Score",22.0000000,1.0000000,,,,,-1.6800000
GTSKSFDGGTR,ph,S,453,false,"Tissue atlas Arabidopsis - ProteomicsDB",114,32188942,"MaxQuant score",132.9300000,0.9960450,,,,5.7025699788937E-6,
GPGNYSFNKACDETK,ph,S,475,true,"Protein sumoylation and phosphorylation cross-talk",97,28419593,,,,,,,,
ALLKGPGNYSFNK,ph,S,475,true,"Chloroplast kinase substrates",60,19376835,"MASCOT Score",56.1700000,,,,,,-0.8212100
GPGNYSFNK,ph,S,475,false,"STN8 phosphoproteome",38,21768351,"MASCOT Score",41.5900000,,,,,,-0.0266644
GPGNYSFNK,ph,S,475,false,"Tyrosine phosphorylation in Arabidopsis",59,18463617,"MASCOT Score",38.0000000,,,,,,-0.5647503
GPGNYSFNK,ph,S,475,false,"Chloroplast kinase substrates",60,19376835,"MASCOT Score",45.5000000,,,,,,0.4618590
GPGNYSFNK,ph,S,475,false,"srk2dei ABA signaling phopshoproteomics",83,23572148,"MASCOT Score",52.0000000,,,,,,-0.0004000
GPGNYSFNK,ph,S,475,false,"SnRK2 protein kinase substrates",85,23776212,XCorr,2.4691646,0.9500000,,,,0.0021334500052035,
GPGNYSFNK,ph,S,475,false,"atm and atr DNA damage response",88,25561503,"MASCOT Score",41.0000000,0.9970000,,,,,-0.8300000
GPGNYSFNK,ph,S,475,false,"Brassinosteroid-Regulated Phosphorylation Dynamics",94,26187819,"MaxQuant Score",98.1560000,1.0000000,,,,0.0080000003799796,1.4720000
GPGNYSFNK,ph,S,475,false,"TOR Kinase and ABA Receptor",100,29290610,XCorr,3.4831800,0.9443000,,,,0.00082110002404079,
GPGNYSFNK,ph,S,475,false,"Phospho cell culture sucrose/TOR",109,30833711,,,1.0000000,,,,,
GPGNYSFNK,ph,S,475,false,"Col-0 callus - FC Col-0 vs. Col-0 Xray",111a,31410901,,36.5900000,,1.5997287,0.0000000,NO,,0.3647049
GPGNYSFNK,ph,S,475,false,"Col-0 X-ray callus - FC Col-0 vs. Col-0 Xray",111b,31410901,,36.5900000,,1.5997287,0.0000000,NO,,0.3647049
GPGNYSFNK,ph,S,475,false,"atm callus - FC atm vs. atm Xray",111c,31410901,,36.5900000,,-1.4579043,0.0000000,NO,,0.3647049
GPGNYSFNK,ph,S,475,false,"atm-3 X-ray callus - FC atm vs. atm Xray",111d,31410901,,36.5900000,,-1.4579043,0.0000000,NO,,0.3647049
GPGNYSFNK,ph,S,475,false,"Tissue atlas Arabidopsis - ProteomicsDB",114,32188942,"MaxQuant score",231.0500000,1.0000000,,,,3.4666500961364E-32,
EVAAMEKEVAAMR,ub,K,576,false,"Arabidopsis ubiquitination COFRADIC",40,26744219,"MaxQuant Score",109.0000000,1.0000000,,,,4.3010000894128E-8,-0.1180000
EVAAMRVDK,mox,M,581,true,"cat2 Methionine oxidation - 1h stress",62a,25693801,"MASCOT Score",41.0000000,,-0.7308999,,NO,,
SSNTKPSSNTAQILAAR,ub,K,598,true,"Arabidopsis ubiquitination COFRADIC",40,26744219,"MaxQuant Score",55.0970000,1.0000000,,,,1.14999998857E-7,0.2480000
