Peptide,PTM,ModifiedAA,ModifiedPosition,PeptideUniqueToGene,ExperimentDesc,ExpID,PubmedID,ScoreType,IdentScore,LocProb,Log2FChange,PQ-val,QuantSig,PEP,MassErrorPPM
AKPVSIEVYNPNGKYR,nt,A,2,true,"N-terminal ChaFRADIC",92,26010716,"MASCOT Score",27.0900000,,,,,7.5120001383766E-6,
AKPVSIEVYNPNGKYR,nt,A,2,true,"Stromal N-terminome",96,26371235,"MASCOT Score",65.2000000,,,,,,
AKPVSIEVYNPNGKYR,nt,A,2,true,"HUNTER N-terminome: legumain, GluC and trypsin",119,31951383,"MaxQuant score",62.6460000,,,,,,
AKPVSIEVYNPN,nt,A,2,true,"N-terminal ChaFRADIC",92,26010716,"MASCOT Score",44.2200000,,,,,0.024110000580549,
AKPVSIEVYNPN,nt,A,2,true,"Arg/N-end rule seed, prt6 vs. Wt",99,29168982,"MASCOT Score",59.1600000,,,,,0.011559999547899,-3.1140864
AKPVSIEVYN,nt,A,2,true,"N-term acetylation drought responses",5,26184543,,,,,,,,
AKPVSIEVY,nt,A,2,true,"Arg/N-end rule seed, prt6 vs. Wt",99,29168982,"MASCOT Score",49.6600000,,,,,0.066119998693466,-0.8803577
AKPVSIEVYNPNGKYR,nta,A,2,true,"N-terminal ChaFRADIC",92,26010716,"MASCOT Score",27.0900000,,,,,7.5120001383766E-6,
AKPVSIEVYNPNGKYR,nta,A,2,true,"Stromal N-terminome",96,26371235,"MASCOT Score",65.2000000,,,,,,
AKPVSIEVYNPNGKYR,nta,A,2,true,"HUNTER N-terminome: legumain, GluC and trypsin",119,31951383,"MaxQuant score",93.2370000,,,,,,
AKPVSIEVYNPNGKYR,nta,A,2,true,"Arabidopsis translation initiation landscape - NTA",167a,35069635,,,,,,,,
AKPVSIEVYNPN,nta,A,2,true,"N-terminal ChaFRADIC",92,26010716,"MASCOT Score",44.2200000,,,,,0.024110000580549,
AKPVSIEVYNPN,nta,A,2,true,"Arg/N-end rule seed, prt6 vs. Wt",99,29168982,"MASCOT Score",59.1600000,,-0.4934463,0.0069173,NO,0.011559999547899,-3.1140864
AKPVSIEVYNPN,nta,A,2,true,"HUNTER N-terminome: legumain, GluC and trypsin",119,31951383,"MaxQuant score",52.2550000,,,,,,
AKPVSIEVYN,nta,A,2,true,"N-term acetylation drought responses",5,26184543,,,,,,,,
AKPVSIEVY,nta,A,2,true,"Arg/N-end rule seed, prt6 vs. Wt",99,29168982,"MASCOT Score",49.6600000,,-0.0140738,0.9503530,NO,0.066119998693466,-0.8803577
AKPVSIEVYNPNGKYR,ac,K,3,true,"Histone deacetylases substrates - hda14 vs WT",98e,29061669,"MaxQuant Score",52.9000000,1.0000000,-0.0550000,0.9289664,NO,0.003000000026077,
AKPVSIEVYNPNGKYR,ac,K,15,true,"Histone deacetylases substrates - hda14 vs WT",98e,29061669,"MaxQuant Score",52.9000000,1.0000000,-0.0550000,0.9289664,NO,0.003000000026077,
VVSTKPMPGTR,ac,K,22,true,"Histone deacetylases - apicidin vs control",98a,29061669,"MaxQuant Score",113.2000000,1.0000000,-0.0610000,0.7277798,NO,3.9999998989515E-5,
WINLLVDQGCR,sno,C,38,true,"Site-specific nitrosomeproteomic id - gsnor1-3",90a,25699590,XCorr,4.2463260,,,,,2.4709999024708E-7,-6.8664567
VEICHLK,sno,C,43,true,"hot5-4 / wildtype, FAT-switch S-nitrosoproteome",169,37277371,,,,-0.4610099,0.0738863,NO,,
VEICHLKK,ac,K,46,true,"Histone deacetylases- hda14 vs WT (low light)",98c,29061669,"MaxQuant Score",51.0700000,1.0000000,0.2360000,0.9885531,NO,0.0489999987185,
RASSMEEVLR,ph,S,228,true,"TOR Kinase and ABA Receptor",100,29290610,XCorr,3.3365436,0.9174000,,,,0.0025090000126511,
RASSMEEVLR,ph,S,229,true,"srk2dei ABA signaling phopshoproteomics",83,23572148,"MASCOT Score",23.0000000,,,,,,0.0002000
ASSMEEVLR,ph,S,229,true,"atm and atr DNA damage response",88,25561503,"MASCOT Score",52.0000000,0.9980000,,,,,0.2700000
ASSMEEVLR,ph,S,229,true,"Tissue atlas Arabidopsis - ProteomicsDB",114,32188942,"MaxQuant score",80.9160000,0.9987860,,,,0.0012869300553575,
SLHPVLDKT,nt,S,241,true,"N-terminal ChaFRADIC",92,26010716,"MASCOT Score",26.2600000,,,,,9.9999997473788E-5,
TTYHLVNKER,ac,K,256,true,"Quantitative Acetylproteomics",101,29440448,,,,,,,,
ERLAMMKK,mox,M,261,true,"cat2 Methionine oxidation - 3h stress",62b,25693801,"MASCOT Score",43.0000000,,-0.3593280,,NO,,
ERLAMMK,mox,M,261,true,"cat2 Methionine oxidation - 1h stress",62a,25693801,"MASCOT Score",43.0000000,,-0.0297406,,NO,,
ERLAMMK,mox,M,261,true,"cat2 Methionine oxidation - 3h stress",62b,25693801,"MASCOT Score",56.0000000,,-0.0884303,,NO,,
ERLAMMKK,mox,M,262,true,"cat2 Methionine oxidation - 3h stress",62b,25693801,"MASCOT Score",43.0000000,,-0.3593280,,NO,,
ERLAMMK,mox,M,262,true,"cat2 Methionine oxidation - 1h stress",62a,25693801,"MASCOT Score",43.0000000,,-0.0297406,,NO,,
ERLAMMK,mox,M,262,true,"cat2 Methionine oxidation - 3h stress",62b,25693801,"MASCOT Score",56.0000000,,-0.0884303,,NO,,
EAILVNCSR,sno,C,271,true,"Cold stress nitrosylation - 4°C vs 22°C",65,24388526,,,,,,,,
EAILVNCSR,sno,C,271,true,"Site-specific nitrosomeproteomic id - gsnor1-3",90a,25699590,XCorr,2.2994099,,,,,0.013109999708831,-6.3616329
EAILVNCSR,sno,C,271,true,"hot5-4 / wildtype, FAT-switch S-nitrosoproteome",169,37277371,,,,-0.5143120,0.0090258,NO,,
GYPIWHDPNRVDPFLNENASPPNASPSIVNSK,ph,S,365,true,"TOR Kinase and ABA Receptor",100,29290610,XCorr,4.2066522,0.9394000,,,,0.001702000037767,
GYPIWHDPNRVDPFLNENASPPNASPSIVNSK,ph,S,365,true,"Tissue atlas Arabidopsis - ProteomicsDB",114,32188942,"MaxQuant score",217.9800000,1.0000000,,,,0,
ALGLPVSKL,ac,K,385,true,"Quantitative Acetylproteomics",101,29440448,,,,,,,,
