Peptide,PTM,ModifiedAA,ModifiedPosition,PeptideUniqueToGene,ExperimentDesc,ExpID,PubmedID,ScoreType,IdentScore,LocProb,Log2FChange,PQ-val,QuantSig,PEP,MassErrorPPM
SVTAAFIDSDQTQHN,nt,S,2,true,"Arg/N-end rule seed, prt6 vs. Wt",99,29168982,"MASCOT Score",34.6700000,,,,,0.096610002219677,-1.3657510
SVTAAFIDSDQTQHNILMDSQSTVSGVK,nta,S,2,true,"Characterization plant N-terminal acetylation",6,22223895,"MASCOT Score",66.5100000,,,,,,
SVTAAFIDSDQTQHNILMD,nta,S,2,true,"HUNTER N-terminome: legumain, GluC and trypsin",119,31951383,"MaxQuant score",98.9420000,,,,,,
SVTAAFIDSDQTQHNILMD,nta,S,2,true,"Arabidopsis translation initiation landscape - NTA",167a,35069635,,,,,,,,
SVTAAFIDSDQTQHN,nta,S,2,true,"Arg/N-end rule seed, prt6 vs. Wt",99,29168982,"MASCOT Score",34.6700000,,,,,0.096610002219677,-1.3657510
SVTAAFIDSDQTQHN,nta,S,2,true,"HUNTER N-terminome: legumain, GluC and trypsin",119,31951383,"MaxQuant score",127.1700000,,,,,,
SVTAAFID,nta,S,2,true,"HUNTER N-terminome: legumain, GluC and trypsin",119,31951383,"MaxQuant score",116.5400000,,,,,,
KEIITLDPSSPK,ph,S,265,true,"Tissue atlas Arabidopsis - ProteomicsDB",114,32188942,"MaxQuant score",260.9600000,0.9543450,,,,0,
EIITLDPSSPK,ph,S,265,true,"Lateral root-induction - NAA vs control",106,23328941,"MASCOT Score",25.0000000,,,,,,
EIITLDPSSPKVPAVVPVK,ph,S,266,true,"Large-scale phosphorylation discovery",44,23111157,XCorr,2.4020000,,,,,,
EIITLDPSSPKVPAVVPVK,ph,S,266,true,"Tissue atlas Arabidopsis - ProteomicsDB",114,32188942,"MaxQuant score",265.3700000,0.9711550,,,,0,
KEIITLDPSSPK,ph,S,266,true,"Large-scale phosphorylation discovery",44,23111157,XCorr,4.8000000,,,,,,
KEIITLDPSSPK,ph,S,266,true,"atm and atr DNA damage response",88,25561503,"MASCOT Score",45.0000000,0.9730000,,,,,-1.9000000
EIITLDPSSPK,ph,S,266,true,"Large-scale phosphorylation discovery",44,23111157,XCorr,2.8820000,,,,,,
EIITLDPSSPK,ph,S,266,true,"Chloroplast kinase substrates",60,19376835,"MASCOT Score",46.2700000,,,,,,-2.6372900
EIITLDPSSPK,ph,S,266,true,"srk2dei ABA signaling phopshoproteomics",83,23572148,"MASCOT Score",38.0000000,,,,,,0.0003000
EIITLDPSSPK,ph,S,266,true,"atm and atr DNA damage response",88,25561503,"MASCOT Score",37.0000000,0.9970000,,,,,-0.7500000
EIITLDPSSPK,ph,S,266,true,"TOR Kinase and ABA Receptor",100,29290610,XCorr,2.9583468,0.9928000,,,,0.00030909999622963,
