Peptide,PTM,ModifiedAA,ModifiedPosition,PeptideUniqueToGene,ExperimentDesc,ExpID,PubmedID,ScoreType,IdentScore,LocProb,Log2FChange,PQ-val,QuantSig,PEP,MassErrorPPM
MENPNPPAEKL,nta,M,1,true,"Arg/N-end rule seed, prt6 vs. Wt",99,29168982,"MASCOT Score",29.7300000,,0.3680846,0.6855110,NO,0.16159999370575,-1.6815397
ELEESQEDLKR,ub,K,26,true,"Arabidopsis ubiquitination COFRADIC",40,26744219,"MaxQuant Score",107.0600000,1.0000000,,,,1.9140000517837E-7,0.8080000
RNSGEGTPLWR,ph,S,55,true,"atm and atr DNA damage response",88,25561503,"MASCOT Score",37.0000000,0.9950000,,,,,-0.9800000
RNSGEGTPLWR,ph,S,55,true,"Tissue atlas Arabidopsis - ProteomicsDB",114,32188942,"MaxQuant score",146.5900000,0.9999990,,,,2.5380099799577E-8,
NSGEGTPLWR,ph,T,59,true,"Tissue atlas Arabidopsis - ProteomicsDB",114,32188942,"MaxQuant score",123.2000000,1.0000000,,,,0.00030851300107315,
TGAASFRHASPLRK,ph,S,69,false,"TOR Kinase and ABA Receptor",100,29290610,XCorr,2.7284629,1.0000000,,,,0.0025349999777973,
KTGAASFR,ph,S,69,false,"atm and atr DNA damage response",88,25561503,"MASCOT Score",35.0000000,1.0000000,,,,,-0.2700000
TGAASFR,ph,S,69,false,"TOR Kinase and ABA Receptor",100,29290610,XCorr,2.5188262,1.0000000,,,,0.0045579997822642,
TGAASFR,ph,S,69,false,"Tissue atlas Arabidopsis - ProteomicsDB",114,32188942,"MaxQuant score",131.6200000,1.0000000,,,,0.0046837897971272,
TGAASFRHASPLRK,ph,S,74,false,"TOR Kinase and ABA Receptor",100,29290610,XCorr,2.7284629,1.0000000,,,,0.0025349999777973,
WQEGDSSFCR,ph,S,232,true,"Tissue atlas Arabidopsis - ProteomicsDB",114,32188942,"MaxQuant score",127.8700000,0.8428420,,,,5.8738398365676E-5,
WQEGDSSFCR,ph,S,233,true,"atm and atr DNA damage response",88,25561503,"MASCOT Score",37.0000000,0.9340000,,,,,-0.0600000
WQEGDSSFCR,ph,S,233,true,"Tissue atlas Arabidopsis - ProteomicsDB",114,32188942,"MaxQuant score",150.0600000,0.8982990,,,,8.3969001707374E-7,
LGLDSQQPIQAAIASK,ph,S,261,true,"Tissue atlas Arabidopsis - ProteomicsDB",114,32188942,"MaxQuant score",55.0110000,0.9999880,,,,0.0027120399754494,
EDAETNDASTPR,ph,T,331,true,"Large-scale phosphorylation discovery",44,23111157,XCorr,3.0910000,,,,,,
EDAETNDASTPR,ph,T,331,true,"atm and atr DNA damage response",88,25561503,"MASCOT Score",83.0000000,0.9970000,,,,,-0.2100000
EDAETNDASTPR,ph,T,331,true,"Tissue atlas Arabidopsis - ProteomicsDB",114,32188942,"MaxQuant score",252.2000000,0.9732910,,,,0,
KGLSWPWK,ph,S,387,false,"atm and atr DNA damage response",88,25561503,"MASCOT Score",24.0000000,1.0000000,,,,,-1.9900000
KGLSWPWK,ph,S,387,false,"Tissue atlas Arabidopsis - ProteomicsDB",114,32188942,"MaxQuant score",120.8600000,1.0000000,,,,0.0022571999579668,
KGLSWPWK,ph,S,387,false,"Touch-induced phosphorylation: 40s touch vs untouc",136,30291188,"MASCOT score",45.5300000,,-0.1078802,0.7921480,NO,,11.7295295
VADFGLSR,ph,S,632,false,"Tissue atlas Arabidopsis - ProteomicsDB",114,32188942,"MaxQuant score",107.8300000,1.0000000,,,,0.0038963700644672,
IKHETYLTTNGR,ph,T,641,true,"Tissue atlas Arabidopsis - ProteomicsDB",114,32188942,"MaxQuant score",75.4450000,0.9077760,,,,0.0010763900354505,
IKHETYLTTNGR,ph,T,642,true,"Tissue atlas Arabidopsis - ProteomicsDB",114,32188942,"MaxQuant score",112.2400000,0.9673090,,,,2.6340099793742E-5,
KYTIQFQAAR,ph,T,746,false,"atm and atr DNA damage response",88,25561503,"MASCOT Score",26.0000000,0.9270000,,,,,-2.0400000
AASIDNSSLK,ph,S,756,true,"atm and atr DNA damage response",88,25561503,"MASCOT Score",65.0000000,1.0000000,,,,,-0.6500000
AASIDNSSLK,ph,S,756,true,"Tissue atlas Arabidopsis - ProteomicsDB",114,32188942,"MaxQuant score",79.6970000,0.9999630,,,,0.0015968499938026,
