Peptide,PTM,ModifiedAA,ModifiedPosition,PeptideUniqueToGene,ExperimentDesc,ExpID,PubmedID,ScoreType,IdentScore,LocProb,Log2FChange,PQ-val,QuantSig,PEP,MassErrorPPM
SKSGIQALCSLHIALEK,ph,S,49,true,"Tissue atlas Arabidopsis - ProteomicsDB",114,32188942,"MaxQuant score",102.8600000,0.9626620,,,,5.8365600352772E-7,
SEILDENDSPGSYPCSPNEDHGSVHGFGR,ph,S,235,true,"Tissue atlas Arabidopsis - ProteomicsDB",114,32188942,"MaxQuant score",76.9720000,0.9667930,,,,1.3970999357404E-10,
LALSDSESTK,ph,S,364,true,"atm and atr DNA damage response",88,25561503,"MASCOT Score",47.0000000,0.9970000,,,,,-0.2700000
LALSDSESTK,ph,S,364,true,"Tissue atlas Arabidopsis - ProteomicsDB",114,32188942,"MaxQuant score",128.0800000,0.9996240,,,,5.6286098697456E-5,
LALSDSESTK,ph,S,368,true,"Tissue atlas Arabidopsis - ProteomicsDB",114,32188942,"MaxQuant score",153.7400000,0.9218920,,,,9.633199624659E-7,
SQSVNSIGSYK,ph,S,373,true,"Tissue atlas Arabidopsis - ProteomicsDB",114,32188942,"MaxQuant score",169.6000000,0.9999840,,,,1.5138600442666E-11,
SQSVNSIGSYK,ph,S,376,true,"Tissue atlas Arabidopsis - ProteomicsDB",114,32188942,"MaxQuant score",59.2270000,0.9377110,,,,0.010158400051296,
SLSAPLSVHGSTPASASVQDYEPR,ph,S,731,true,"Tissue atlas Arabidopsis - ProteomicsDB",114,32188942,"MaxQuant score",263.1600000,0.9956290,,,,0,
SLSAPLSVHGSTPASASVQDYEPR,ph,S,733,true,"Tissue atlas Arabidopsis - ProteomicsDB",114,32188942,"MaxQuant score",295.0400000,0.9999240,,,,0,
