Peptide,PTM,ModifiedAA,ModifiedPosition,PeptideUniqueToGene,ExperimentDesc,ExpID,PubmedID,ScoreType,IdentScore,LocProb,Log2FChange,PQ-val,QuantSig,PEP,MassErrorPPM
LSECPR,sno,C,214,true,"hot5-4 / wildtype, FAT-switch S-nitrosoproteome",169,37277371,,,,,,,,
RLDTWDVNSFSEPFEIHSR,ph,T,323,true,"TOR Kinase and ABA Receptor",100,29290610,XCorr,4.1455417,0.9975000,,,,0.00020350000704639,
RLDTWDVNSFSEPFEIHSR,ph,T,323,true,"Phospho cell culture sucrose/TOR",109,30833711,,,0.9816240,,,,,
RLDTWDVNSFSEPFEIHSR,ph,T,323,true,"Tissue atlas Arabidopsis - ProteomicsDB",114,32188942,"MaxQuant score",133.4700000,0.9999950,,,,9.4959402584846E-16,
QNLEAVAHCVQNK,so,C,2084,true,"Arabidopsis S-sulfenylation chemoproteomics",108,31578252,"pFind PSM Score",0.2007950,,0.9615400,,,,-0.1661456
NANLCNPTVLDR,so,C,2279,true,"Arabidopsis S-sulfenylation chemoproteomics",108,31578252,"pFind PSM Score",0.0029048,,,,,,-1.0333066
ALIGSSCAPDAANFENDLASK,sno,C,2559,true,"hot5-4 / wildtype, FAT-switch S-nitrosoproteome",169,37277371,,,,,,,,
FCITDSR,so,C,3614,true,"S-sulfenylation site detection using YAP1C",110,32714340,,,,,,,,
AENDLNLDNLCK,sno,C,4452,true,"hot5-4 / wildtype, FAT-switch S-nitrosoproteome",169,37277371,,,,1.0750119,0.0003001,YES,,
DVSDQIEDEDQLHGTDK,ph,S,4561,true,"Tissue atlas Arabidopsis - ProteomicsDB",114,32188942,"MaxQuant score",152.5800000,1.0000000,,,,5.7867800178427E-13,
GIEMSDEFDGK,ph,S,4596,true,"Tyrosine phosphorylation in Arabidopsis",59,18463617,"MASCOT Score",43.0000000,,,,,,-0.8419585
GIEMSDEFDGK,ph,S,4596,true,"Tissue atlas Arabidopsis - ProteomicsDB",114,32188942,"MaxQuant score",144.9200000,1.0000000,,,,1.2143299699119E-8,
EYSVSEDEEEDK,ph,S,4605,true,"TOR Kinase and ABA Receptor",100,29290610,XCorr,3.3969669,0.9923000,,,,0.00087980000535026,
EYSVSEDEEEDK,ph,S,4607,true,"TOR Kinase and ABA Receptor",100,29290610,XCorr,3.3969669,0.9923000,,,,0.00087980000535026,
EDEGSEDEPLDNGIGDVGSDAEK,ph,S,4619,true,"TOR Kinase and ABA Receptor",100,29290610,XCorr,6.6640778,1.0000000,,,,6.9140000391599E-9,
EDEGSEDEPLDNGIGDVGSDAEK,ph,S,4633,true,"TOR Kinase and ABA Receptor",100,29290610,XCorr,6.6640778,1.0000000,,,,6.9140000391599E-9,
EEALGGLTPDVDNEQIDDDMEMDKTEEVEK,ph,T,4730,true,"Tissue atlas Arabidopsis - ProteomicsDB",114,32188942,"MaxQuant score",168.6500000,1.0000000,,,,0,
EEALGGLTPDVDNEQIDDDMEMDK,ph,T,4730,true,"TOR Kinase and ABA Receptor",100,29290610,XCorr,5.6121087,1.0000000,,,,4.098999852431E-5,
EEALGGLTPDVDNEQIDDDMEMDK,ph,T,4730,true,"Phospho cell culture sucrose/TOR",109,30833711,,,1.0000000,,,,,
HPEEGENDQEETQEPSEENMEAEAEDR,ph,S,4783,true,"TOR Kinase and ABA Receptor",100,29290610,XCorr,4.1183429,1.0000000,,,,5.913999848417E-5,
CGSPQKEEPGNDLEQEPETEPIEGK,ph,S,4797,true,"srk2dei ABA signaling phopshoproteomics",83,23572148,"MASCOT Score",38.0000000,,,,,,0.0006000
CGSPQKEEPGNDLEQEPETEPIEGK,ph,S,4797,true,"SnRK2 protein kinase substrates",85,23776212,XCorr,5.4567766,1.0000000,,,,1.4288199512436E-9,
CGSPQKEEPGNDLEQEPETEPIEGK,ph,S,4797,true,"Phospho cell culture sucrose/TOR",109,30833711,,,1.0000000,,,,,
CGSPQKEEPGNDLEQEPETEPIEGK,ph,S,4797,true,"Tissue atlas Arabidopsis - ProteomicsDB",114,32188942,"MaxQuant score",207.1900000,1.0000000,,,,0,
EVMSEDMMKPNFR,ph,S,4823,true,"Tissue atlas Arabidopsis - ProteomicsDB",114,32188942,"MaxQuant score",250.6900000,1.0000000,,,,0,
EGESEEEK,ph,S,4993,true,"atm and atr DNA damage response",88,25561503,"MASCOT Score",32.0000000,1.0000000,,,,,0.1600000
LAGNQDDVSPMDIDDLNPENKPAVQSK,ph,S,5006,true,"Phospho cell culture sucrose/TOR",109,30833711,,,0.9995200,,,,,
LAGNQDDVSPMDIDDLNPENKPAVQSK,ph,S,5006,true,"Tissue atlas Arabidopsis - ProteomicsDB",114,32188942,"MaxQuant score",135.4500000,1.0000000,,,,7.1606351526998E-43,
THQENSPIHNFGDGNSR,ph,T,5043,true,"Col-0 callus - FC Col-0 vs. Col-0 Xray",111a,31410901,,32.8400000,,2.0800238,0.0000000,NO,,0.5126242
THQENSPIHNFGDGNSR,ph,T,5043,true,"Col-0 X-ray callus - FC Col-0 vs. Col-0 Xray",111b,31410901,,32.8400000,,2.0800238,0.0000000,NO,,0.5126242
THQENSPIHNFGDGNSR,ph,T,5043,true,"atm callus - FC atm vs. atm Xray",111c,31410901,,32.8400000,,-0.5543389,0.0000000,NO,,0.5126242
THQENSPIHNFGDGNSR,ph,T,5043,true,"atm-3 X-ray callus - FC atm vs. atm Xray",111d,31410901,,32.8400000,,-0.5543389,0.0000000,NO,,0.5126242
THQENSPIHNFGDGNSR,ph,S,5048,true,"Tyrosine phosphorylation in Arabidopsis",59,18463617,"MASCOT Score",48.0000000,,,,,,-0.6536568
THQENSPIHNFGDGNSR,ph,S,5048,true,"Conserved plant phosphoproteome - Arabidopsis",61a,20466843,"MASCOT Score",48.0000000,1.0000000,,,,,
THQENSPIHNFGDGNSR,ph,S,5048,true,"SnRK2 protein kinase substrates",85,23776212,XCorr,2.1570547,0.9950000,,,,0.00013475300511345,
THQENSPIHNFGDGNSR,ph,S,5048,true,"atm and atr DNA damage response",88,25561503,"MASCOT Score",49.0000000,0.9990000,,,,,-0.1700000
THQENSPIHNFGDGNSR,ph,S,5048,true,"TOR Kinase and ABA Receptor",100,29290610,XCorr,2.9915206,0.9837000,,,,0.0016850000247359,
THQENSPIHNFGDGNSR,ph,S,5048,true,"Lateral root-induction - NAA vs control",106,23328941,"MASCOT Score",25.0000000,,,,,,
THQENSPIHNFGDGNSR,ph,S,5048,true,"Phospho cell culture sucrose/TOR",109,30833711,,,1.0000000,,,,,
THQENSPIHNFGDGNSR,ph,S,5048,true,"Col-0 callus - FC Col-0 vs. Col-0 Xray",111a,31410901,,31.9400000,,-0.5832103,0.0000000,NO,,0.2230900
THQENSPIHNFGDGNSR,ph,S,5048,true,"Col-0 X-ray callus - FC Col-0 vs. Col-0 Xray",111b,31410901,,31.9400000,,-0.5832103,0.0000000,NO,,0.2230900
THQENSPIHNFGDGNSR,ph,S,5048,true,"atm callus - FC atm vs. atm Xray",111c,31410901,,31.9400000,,1.0029542,0.0000000,NO,,0.2230900
THQENSPIHNFGDGNSR,ph,S,5048,true,"atm-3 X-ray callus - FC atm vs. atm Xray",111d,31410901,,31.9400000,,1.0029542,0.0000000,NO,,0.2230900
THQENSPIHNFGDGNSR,ph,S,5048,true,"Tissue atlas Arabidopsis - ProteomicsDB",114,32188942,"MaxQuant score",273.1800000,1.0000000,,,,0,
MQVTDNDSESNQDNQEDPDAR,ph,T,5084,true,"atm and atr DNA damage response",88,25561503,"MASCOT Score",31.0000000,0.9990000,,,,,0.1000000
MQVTDNDSESNQDNQEDPDAR,ph,S,5088,true,"atm and atr DNA damage response",88,25561503,"MASCOT Score",63.0000000,0.9970000,,,,,-0.5000000
MQVTDNDSESNQDNQEDPDAR,ph,S,5088,true,"TOR Kinase and ABA Receptor",100,29290610,XCorr,5.3188562,0.9812000,,,,8.0299997762268E-8,
MQVTDNDSESNQDNQEDPDAR,ph,S,5088,true,"Tissue atlas Arabidopsis - ProteomicsDB",114,32188942,"MaxQuant score",179.3800000,0.9996550,,,,0,
ALATVCR,so,C,5207,true,"Arabidopsis S-sulfenylation chemoproteomics",108,31578252,"pFind PSM Score",0.1740790,,0.9606600,,,,0.4350718
