Peptide,PTM,ModifiedAA,ModifiedPosition,PeptideUniqueToGene,ExperimentDesc,ExpID,PubmedID,ScoreType,IdentScore,LocProb,Log2FChange,PQ-val,QuantSig,PEP,MassErrorPPM
ASSMLSSATMVASPAQATMVAPFNGLKSSAAFPATR,nt,A,2,true,"Stromal N-terminome",96,26371235,"MASCOT Score",43.8500000,,,,,,
ASSMLSSATMVASPAQATMVAPFNGLKSSAAFPATR,nta,A,2,true,"Stromal N-terminome",96,26371235,"MASCOT Score",43.8500000,,,,,,
ASSMLSSATM,nta,A,2,true,"Characterization plant N-terminal acetylation",6,22223895,"MASCOT Score",60.6400000,,,,,,
MQVWPPIGKKKFETLSYLPDLTDSELAKEVDYLIR,nt,M,56,true,"Stromal N-terminome",96,26371235,"MASCOT Score",38.7100000,,,,,,
MQVWPPIGKKKFETLSYLPDLTD,nt,M,56,true,"HUNTER N-terminome: legumain, GluC and trypsin",119,31951383,"MaxQuant score",80.7520000,,,,,,
MQVWPPIGKKKFETLSYLPD,nt,M,56,true,"HUNTER N-terminome: legumain, GluC and trypsin",119,31951383,"MaxQuant score",82.4820000,,,,,,
MQVWPPIGKKKFE,nt,M,56,true,"HUNTER N-terminome: legumain, GluC and trypsin",119,31951383,"MaxQuant score",127.0200000,,,,,,
QVWPPIGKKKFE,nt,Q,57,true,"HUNTER N-terminome: legumain, GluC and trypsin",119,31951383,"MaxQuant score",84.7180000,,,,,,
VWPPIGKK,ac,K,64,false,"Quantitative Acetylproteomics",101,29440448,,,,,,,,
KFETLSYLPDLTDSELAK,ac,K,66,true,"Histone deacetylases - apicidin vs control",98a,29061669,"MaxQuant Score",140.3000000,1.0000000,0.0360000,0.8649679,NO,0,
KFETLSYLPDLTDSELAK,ac,K,66,true,"Histone deacetylases substrates - TSA vs control",98b,29061669,"MaxQuant Score",140.3000000,1.0000000,0.5900000,0.7998343,NO,0,
KFETLSYLPDLTDSELAK,ac,K,66,true,"Histone deacetylases- hda14 vs WT (low light)",98c,29061669,"MaxQuant Score",173.9800000,1.0000000,0.2220000,0.9931160,NO,6.4000001079193E-15,
KFETLSYLPDLTDSELAK,ac,K,66,true,"Histone deacetylases substrates - hda14 vs WT",98e,29061669,"MaxQuant Score",107.7000000,1.0000000,1.3930000,0.7870458,NO,1.3000000395245E-20,
KKFETLSYLPDLTDSELAK,cr,K,66,true,"Open search Plant PTM Viewer 2.0 - Crotonylation",164c,TBA,,,,,,,,
KFETLSYLPDLTDSELAK,cr,K,66,true,"Open search Plant PTM Viewer 2.0 - Crotonylation",164c,TBA,,,,,,,,
KKFETLSYLPDLTDSELAK,hib,K,66,true,"Open search Plant PTM Viewer 2.0 - hib",164e,TBA,,,,,,,,
TLSYLPDLTDSELAKEVDYLIR,nt,T,69,true,"Stromal N-terminome",96,26371235,"MASCOT Score",51.1900000,,,,,,
TLSYLPDLTDSELAKE,nt,T,69,true,"N-terminal ChaFRADIC",92,26010716,"MASCOT Score",60.2400000,,,,,3.4820000216484E-9,
TLSYLPDLTDSE,nt,T,69,true,"N-terminal ChaFRADIC",92,26010716,"MASCOT Score",61.6500000,,,,,5.6520002544858E-7,
TLSYLPDLTDSE,nt,T,69,true,"Stromal N-terminome",96,26371235,"MASCOT Score",48.5000000,,,,,,
TLSYLPDLTDSE,nt,T,69,true,"Arg/N-end rule seed, prt6 vs. Wt",99,29168982,"MASCOT Score",39.7400000,,-0.7977731,0.1880874,NO,0.00011390000145184,-1.7827103
TLSYLPDLTDSE,nt,T,69,true,"HUNTER N-terminome: legumain, GluC and trypsin",119,31951383,"MaxQuant score",157.9100000,,,,,,
TLSYLPDLTD,nt,T,69,false,"HUNTER N-terminome: legumain, GluC and trypsin",119,31951383,"MaxQuant score",75.1090000,,,,,,
SYLPDLTDSELAKEVDYLIR,nt,S,71,true,"Metacaspase9 substrates - Col-0 / mc9",51a,23964026,"MASCOT Score",46.0000000,,1.0811495,,NO,,-2.3318402
SYLPDLTDSELAKEVDYLIR,nt,S,71,true,"Stromal N-terminome",96,26371235,"MASCOT Score",43.1300000,,,,,,
SYLPDLTDSELAKEVDYL,nt,S,71,true,"N-terminal ChaFRADIC",92,26010716,"MASCOT Score",34.1100000,,,,,4.5470001168724E-6,
SYLPDLTDSELAKEVD,nt,S,71,true,"HUNTER N-terminome: legumain, GluC and trypsin",119,31951383,"MaxQuant score",104.8700000,,,,,,
SYLPDLTDSELAKE,nt,S,71,true,"N-terminal ChaFRADIC",92,26010716,"MASCOT Score",36.5800000,,,,,6.4189997317499E-8,
SYLPDLTDSELAK,nt,S,71,true,"N-terminal ChaFRADIC",92,26010716,"MASCOT Score",55.1500000,,,,,1.2300000129528E-8,
SYLPDLTDSELA,nt,S,71,true,"N-terminal ChaFRADIC",92,26010716,"MASCOT Score",62.8600000,,,,,0.067929998040199,
SYLPDLTDSE,nt,S,71,true,"N-terminal ChaFRADIC",92,26010716,"MASCOT Score",42.3400000,,,,,0.00015300000086427,
SYLPDLTDSE,nt,S,71,true,"HUNTER N-terminome: legumain, GluC and trypsin",119,31951383,"MaxQuant score",116.7300000,,,,,,
SYLPDLTDS,nt,S,71,true,"N-terminal ChaFRADIC",92,26010716,"MASCOT Score",54.2400000,,,,,0.00025139999343082,
YLPDLTDSELAKE,nt,Y,72,true,"N-terminal ChaFRADIC",92,26010716,"MASCOT Score",68.6800000,,,,,7.7589999136762E-7,
LPDLTDSELAKE,nt,L,73,true,"N-terminal ChaFRADIC",92,26010716,"MASCOT Score",43.9400000,,,,,0.0024979999288917,
LPDLTDSE,nt,L,73,true,"N-terminal ChaFRADIC",92,26010716,"MASCOT Score",34.7100000,,,,,0.017689999192953,
LTDSELAKEVDYLIR,nt,L,76,true,"Stromal N-terminome",96,26371235,"MASCOT Score",35.4500000,,,,,,
TDSELAKEVDYLIR,nt,T,77,true,"Stromal N-terminome",96,26371235,"MASCOT Score",47.4900000,,,,,,
KFETLSYLPDLTDSELAK,ph,T,77,true,"Tissue atlas Arabidopsis - ProteomicsDB",114,32188942,"MaxQuant score",98.6820000,0.8933030,,,,8.3388204075163E-6,
SELAKEVDYLIR,nt,S,79,true,"Stromal N-terminome",96,26371235,"MASCOT Score",33.1200000,,,,,,
SELAKEVDYLIR,nt,S,79,true,"HUNTER N-terminome: legumain, GluC and trypsin",119,31951383,"MaxQuant score",97.6900000,,,,,,
KKFETLSYLPDLTDSELAK,ph,S,79,true,"Tissue atlas Arabidopsis - ProteomicsDB",114,32188942,"MaxQuant score",110.8300000,0.9966650,,,,1.3104399509967E-10,
KFETLSYLPDLTDSELAK,ph,S,79,true,"TOR Kinase and ABA Receptor",100,29290610,XCorr,7.0267382,0.9900000,,,,1.4540000314867E-8,
FETLSYLPDLTDSELAK,ph,S,79,true,"srk2dei ABA signaling phopshoproteomics",83,23572148,"MASCOT Score",26.0000000,,,,,,0.0017000
FETLSYLPDLTDSELAK,ph,S,79,true,"Touch-induced phosphorylation: 40s touch vs untouc",136,30291188,"MASCOT score",68.8900000,,0.1088984,0.2394589,NO,,2.3651742
KFETLSYLPDLTDSELAKEVDYLIR,ac,K,83,true,"Histone deacetylases substrates - hda14 vs WT",98e,29061669,"MaxQuant Score",285.1000000,1.0000000,-0.1090000,0.9289664,NO,0,
NKWIPCVEFELEHGFVYR,ac,K,92,false,"Lysine acetylation gel-based Arabidopsis",36,21311030,"MASCOT Score",87.0000000,,,,,,0.4520000
NKWIPCVEFELEHGFVYR,ac,K,92,false,"Histone deacetylases substrates - TSA vs control",98b,29061669,"MaxQuant Score",139.0000000,1.0000000,-0.0760000,0.9977001,NO,1.2999999853145E-30,
NKWIPCVEFELEHGFVYR,ac,K,92,false,"Histone deacetylases- hda14 vs WT (low light)",98c,29061669,"MaxQuant Score",176.0100000,1.0000000,0.2490000,0.9885531,NO,1.7999999377081E-16,
NKWIPCVEFELEHGFVYR,ac,K,92,false,"Histone deacetylases substrates - hda14 vs WT",98e,29061669,"MaxQuant Score",212.9000000,1.0000000,-0.1240000,0.9162205,NO,0,
NKWIPCVEFELEHGFVYR,ub,K,92,false,"upl3 mutant / wildtype",168,35926874,"MaxQuant score",116.0600000,1.0000000,3.6539772,,,1.0976300163917E-12,-0.0839610
WIPCVEFELEHGFVYR,sno,C,96,false,"Cold stress nitrosylation - 4°C vs 22°C",65,24388526,,,,2.8479969,,NO,,
WIPCVEFELEHGFVYR,sno,C,96,false,"Site-specific nitrosomeproteomic id - gsnor1-3",90b,25699590,XCorr,3.1500000,,,,,0.0011540000559762,-6.4800000
VEFELEHGFVYR,nt,V,97,false,"Arg/N-end rule seed, prt6 vs. Wt",99,29168982,"MASCOT Score",28.4600000,,,,,0.011359999887645,4.3286066
VEFELEHGFVYR,nt,V,97,false,"FtsH12 N-terminome: WT / FtsH12 knockdown miRNA",118,33216923,"MaxQuant score",85.2480000,,-0.0206892,0.9167151,NO,2.5000000292152E-8,
REHGNSPGYYDGR,nt,R,108,true,"N-terminal ChaFRADIC",92,26010716,"MASCOT Score",42.2900000,,,,,1.045000033173E-7,
GNSPGYYDGR,nt,G,111,true,"N-terminal ChaFRADIC",92,26010716,"MASCOT Score",24.6000000,,,,,0.015720000490546,
GNSPGYYDGR,nt,G,111,true,"Arg/N-end rule seed, prt6 vs. Wt",99,29168982,"MASCOT Score",42.5400000,,-1.4380144,0.1269069,NO,0.06572999805212,-0.8449986
SPGYYDGR,nt,S,113,true,"N-terminal ChaFRADIC",92,26010716,"MASCOT Score",30.7900000,,,,,0.0056759999133646,
EHGNSPGYYDGR,ph,S,113,true,"STN8 phosphoproteome",38,21768351,"MASCOT Score",67.5400000,,,,,,-0.4030480
EHGNSPGYYDGR,ph,S,113,true,"Chloroplast kinase substrates",60,19376835,"MASCOT Score",68.1900000,,,,,,-0.8498070
EHGNSPGYYDGR,ph,S,113,true,"srk2dei ABA signaling phopshoproteomics",83,23572148,"MASCOT Score",53.0000000,,,,,,0.0001000
EHGNSPGYYDGR,ph,S,113,true,"SnRK2 protein kinase substrates",85,23776212,XCorr,2.1683133,0.9930000,,,,0.0043498701415956,
EHGNSPGYYDGR,ph,S,113,true,"atm and atr DNA damage response",88,25561503,"MASCOT Score",63.0000000,1.0000000,,,,,0.3600000
EHGNSPGYYDGR,ph,S,113,true,"TOR Kinase and ABA Receptor",100,29290610,XCorr,3.6067674,1.0000000,,,,0.00016019999748096,
EHGNSPGYYDGR,ph,S,113,true,"Phospho cell culture sucrose/TOR",109,30833711,,,0.9999650,,,,,
EHGNSPGYYDGR,ph,S,113,true,"Tissue atlas Arabidopsis - ProteomicsDB",114,32188942,"MaxQuant score",271.0000000,1.0000000,,,,0,
YWTMWKLPLFGCTDSAQVLK,ac,K,126,false,"Lysine acetylation gel-based Finkemeier et al",37,21311031,i-probability,0.9644350,,,,,,
YWTMWKLPLFGCTDSAQVLK,ac,K,126,false,"Histone deacetylases- hda14 vs WT (low light)",98c,29061669,"MaxQuant Score",121.8200000,1.0000000,-0.4860000,0.9885531,NO,4.9000000501565E-8,
YWTMWKLPLFGCTDSAQVLK,ub,K,126,false,"upl3 mutant / wildtype",168,35926874,"MaxQuant score",116.0900000,1.0000000,0.5350576,,,8.7598798928588E-14,-0.9067500
LPLFGCTDSAQVLK,sno,C,132,false,"Cold stress nitrosylation - 4°C vs 22°C",65,24388526,,,,2.5109619,,NO,,
LPLFGCTDSAQVLK,sno,C,132,false,"Site-specific nitrosomeproteomic id - gsnor1-3",90a,25699590,XCorr,4.2500000,,,,,3.7000000929766E-7,-6.0000000
LPLFGCTDSAQVLK,sno,C,132,false,"Site-specific nitrosomeproteomic id - gsnor1-3",90b,25699590,XCorr,4.6908674,,,,,0.034359999001026,-4.8030474
LPLFGCTDSAQVLK,sno,C,132,false,"hot5-4 / wildtype, FAT-switch S-nitrosoproteome",169,37277371,,,,,,,,
LPLFGCTDSAQVLK,so,C,132,false,"Arabidopsis S-sulfenylation chemoproteomics",108,31578252,"pFind PSM Score",0.0090986,,0.8178500,,,,1.8554839
LPLFGCTDSAQVLK,so,C,132,false,"S-sulfenylation site detection using YAP1C",110,32714340,,,,,,,,
LPLFGCTDSAQVLK,ph,T,133,false,"srk2dei ABA signaling phopshoproteomics",83,23572148,"MASCOT Score",46.0000000,,,,,,0.0010000
LPLFGCTDSAQVLK,ph,T,133,false,"SnRK2 protein kinase substrates",85,23776212,XCorr,2.6317387,0.9990000,,,,0.022136399522424,
LPLFGCTDSAQVLK,ph,T,133,false,"TOR Kinase and ABA Receptor",100,29290610,XCorr,5.1642580,1.0000000,,,,9.9279998266866E-7,
SAQVLKEVEECKKEYPNAFIR,nt,S,135,true,"Stromal N-terminome",96,26371235,"MASCOT Score",32.5300000,,,,,,
LPLFGCTDSAQVLK,ph,S,135,false,"srk2dei ABA signaling phopshoproteomics",83,23572148,"MASCOT Score",61.0000000,,,,,,0.0024000
LPLFGCTDSAQVLK,ph,S,135,false,"Tissue atlas Arabidopsis - ProteomicsDB",114,32188942,"MaxQuant score",202.5200000,0.9984610,,,,5.755132792982E-42,
LPLFGCTDSAQVLKEVEECK,ac,K,140,false,"Histone deacetylases - apicidin vs control",98a,29061669,"MaxQuant Score",283.8000000,1.0000000,0.3840000,0.0721107,NO,0,
LPLFGCTDSAQVLKEVEECK,ac,K,140,false,"Histone deacetylases substrates - TSA vs control",98b,29061669,"MaxQuant Score",283.8000000,1.0000000,-0.0340000,0.9977001,NO,0,
LPLFGCTDSAQVLKEVEECK,ac,K,140,false,"Histone deacetylases- hda14 vs WT (low light)",98c,29061669,"MaxQuant Score",269.1600000,1.0000000,-0.3160000,0.9885531,NO,0,
LPLFGCTDSAQVLKEVEECK,ac,K,140,false,"Histone deacetylases substrates - hda14 vs WT",98e,29061669,"MaxQuant Score",320.3000000,1.0000000,0.2450000,0.8912509,NO,0,
LPLFGCTDSAQVLKEVEECKK,cr,K,140,false,"Open search Plant PTM Viewer 2.0 - Crotonylation",164c,TBA,,,,,,,,
LPLFGCTDSAQVLKEVEECKK,hib,K,140,false,"Open search Plant PTM Viewer 2.0 - hib",164e,TBA,,,,,,,,
LPLFGCTDSAQVLKEVEECKK,ub,K,140,false,"upl3 mutant / wildtype",168,35926874,"MaxQuant score",162.7600000,1.0000000,-0.1893513,0.7822600,NO,3.1556700681158E-30,-0.3360000
EVEECK,sno,C,145,false,"hot5-4 / wildtype, FAT-switch S-nitrosoproteome",169,37277371,,,,,,,,
EVEECKK,so,C,145,false,"S-sulfenylation site detection using YAP1C",110,32714340,,,,,,,,
EVEECKK,ac,K,146,false,"Histone deacetylases - apicidin vs control",98a,29061669,"MaxQuant Score",113.5000000,1.0000000,0.1520000,0.5382698,NO,5.8999999055231E-6,
EVEECKK,ac,K,146,false,"Histone deacetylases substrates - TSA vs control",98b,29061669,"MaxQuant Score",113.5000000,1.0000000,0.1620000,0.9977001,NO,5.8999999055231E-6,
EVEECKK,ac,K,146,false,"Histone deacetylases- hda14 vs WT (low light)",98c,29061669,"MaxQuant Score",133.1200000,1.0000000,0.3410000,0.9931160,NO,0.032999999821186,
EVEECKKEYPNAFIR,ac,K,147,true,"Histone deacetylases- hda14 vs WT (low light)",98c,29061669,"MaxQuant Score",167.6900000,0.8300000,-0.4860000,0.9885531,NO,9.0000003977186E-12,
KEYPNAFIR,ac,K,147,true,"Histone deacetylases - apicidin vs control",98a,29061669,"MaxQuant Score",119.5000000,1.0000000,0.1440000,0.5445027,NO,1.8999999327769E-15,
KEYPNAFIR,ac,K,147,true,"Histone deacetylases substrates - TSA vs control",98b,29061669,"MaxQuant Score",119.5000000,1.0000000,0.2800000,0.9977001,NO,1.8999999327769E-15,
EVEECKKEYPNAFIR,cr,K,147,true,"Open search Plant PTM Viewer 2.0 - Crotonylation",164c,TBA,,,,,,,,
EVEECKKEYPNAFIR,hib,K,147,true,"Open search Plant PTM Viewer 2.0 - hib",164e,TBA,,,,,,,,
EVEECKKEYPNAFIR,ub,K,147,true,"upl3 mutant / wildtype",168,35926874,"MaxQuant score",84.7530000,0.8330000,0.5038575,0.1472630,NO,1.1158599590999E-5,-0.7764400
IIGFDNTR,nt,I,156,false,"Stromal N-terminome",96,26371235,"MASCOT Score",34.6000000,,,,,,
IIGFDNTR,nt,I,156,false,"Arg/N-end rule seed, prt6 vs. Wt",99,29168982,"MASCOT Score",39.5200000,,,,,0.044039998203516,-0.5988202
TRQVQCISFIAYKPPSFTG,nt,T,162,true,"HUNTER N-terminome: legumain, GluC and trypsin",119,31951383,"MaxQuant score",65.9540000,,,,,,
IIGFDNTR,ph,T,162,false,"srk2dei ABA signaling phopshoproteomics",83,23572148,"MASCOT Score",25.0000000,,,,,,0.0007000
IIGFDNTR,ph,T,162,false,"atm and atr DNA damage response",88,25561503,"MASCOT Score",40.0000000,1.0000000,,,,,0.3900000
IIGFDNTR,ph,T,162,false,"Tissue atlas Arabidopsis - ProteomicsDB",114,32188942,"MaxQuant score",130.9800000,1.0000000,,,,0.0080065103247762,
QVQCISFIAYKPPSFTG,nt,Q,164,true,"Tic56 chloroplast import - wild-type",89a,25588737,XCorr,3.2876015,,,,,,
QVQCISFIAYKPPSFTG,nt,Q,164,true,"HUNTER N-terminome: legumain, GluC and trypsin",119,31951383,"MaxQuant score",81.4310000,,,,,,
QVQCISFIAYKPPSFTG,acy,C,167,true,"Arabidopsis S-acylation atlas - Silique",163e,35681017,,,,,,,,
QVQCISFIAYKPPSFTG,ox,C,167,true,"OxiTRAQ SA and flg22 responses - SA vs mock",91a,25720653,"MASCOT Score",22.5900000,,1.0840643,0.0010000,YES,,
QVQCISFIAYKPPSFTG,ox,C,167,true,"OxiTRAQ SA and flg22 responses - flg22 vs mock",91b,25720653,"MASCOT Score",22.5900000,,1.0143553,0.0010000,YES,,
QVQCISFIAYKPPSFTG,sno,C,167,true,"Site-specific nitrosomeproteomic id - gsnor1-3",90a,25699590,XCorr,2.1260698,,,,,0.0056070000864565,-4.1453788
QVQCISFIAYKPPSFTG,sno,C,167,true,"Site-specific nitrosomeproteomic id - gsnor1-3",90b,25699590,XCorr,3.3200000,,,,,0.00031500001205131,-7.0400000
QVQCISFIAYKPPSFTG,so,C,167,true,"S-sulfenylation site detection using YAP1C",110,32714340,,,,,,,,
QVQCISFIAYKPPSFTG,ph,S,177,true,"Chloroplast kinase substrates",60,19376835,"MASCOT Score",39.5800000,,,,,,-1.3045700
QVQCISFIAYKPPSFTG,ph,T,179,true,"TOR Kinase and ABA Receptor",100,29290610,XCorr,4.2612777,0.9037000,,,,2.4740000299062E-5,
