Peptide,PTM,ModifiedAA,ModifiedPosition,PeptideUniqueToGene,ExperimentDesc,ExpID,PubmedID,ScoreType,IdentScore,LocProb,Log2FChange,PQ-val,QuantSig,PEP,MassErrorPPM
SNQGLGWCE,nt,S,26,false,"Arg/N-end rule seed, prt6 vs. Wt",99,29168982,"MASCOT Score",34.1300000,,-0.1842538,0.6034018,NO,0.022110000252724,-1.2226902
NNITSLFISNQK,ng,N,70,true,"UDP-GlcNAc transporter glycopeptide analysis",135,30224661,,,,,,,5.2810104379797E-12,0.5000000
YPESCR,sno,C,165,true,"hot5-4 / wildtype, FAT-switch S-nitrosoproteome",169,37277371,,,,,,,,
EKELNVTNLESVLR,ng,N,185,true,"N-linked Glycan Micro-heterogeneity Arabidopsis",134,29237727,,,,,,,,
EKELNVTNLESVLR,ng,N,185,true,"UDP-GlcNAc transporter glycopeptide analysis",135,30224661,,,,,,,1.1476827390801E-15,0.3000000
ELNVTNLESVLRK,ng,N,185,true,"Conserved N-glycosylation",74,22633491,"MaxQuant Score",177.0100000,1.0000000,,,,1.5730000715093E-33,0.2940000
ELNVTNLESVLR,ng,N,185,true,"UDP-GlcNAc transporter glycopeptide analysis",135,30224661,,,,,,,3.5916807180313E-13,0.0000000
CHVFNENLTPGVK,acy,C,218,true,"Arabidopsis S-acylation atlas - Meristem",163a,35681017,,,,,,,,
CHVFNENLTPGVK,acy,C,218,true,"Arabidopsis S-acylation atlas - Silique",163e,35681017,,,,,,,,
CHVFNENLTPGVK,sno,C,218,true,"hot5-4 / wildtype, FAT-switch S-nitrosoproteome",169,37277371,,,,,,,,
CRPPSDSEGSCGYNQTSSTFLCYCK,ng,N,244,true,"Conserved N-glycosylation",74,22633491,"MaxQuant Score",227.7200000,1.0000000,,,,0,0.1880000
DPYSLSCSSGK,sno,C,262,true,"hot5-4 / wildtype, FAT-switch S-nitrosoproteome",169,37277371,,,,-0.1812743,0.2780484,NO,,
SSDALEVPPRPIK,ph,S,307,true,"Tissue atlas Arabidopsis - ProteomicsDB",114,32188942,"MaxQuant score",190.5700000,0.8528660,,,,5.9067699633904E-30,
SSDALEVPPRPIKESPTLSEDIK,ph,S,321,true,"TOR Kinase and ABA Receptor",100,29290610,XCorr,3.9639363,0.7620000,,,,0.00022489999537356,
PIKESPTLSEDIK,ph,S,321,true,"atm and atr DNA damage response",88,25561503,"MASCOT Score",42.0000000,1.0000000,,,,,0.1200000
ESPTLSEDIK,ph,S,321,true,"STN8 phosphoproteome",38,21768351,"MASCOT Score",49.9500000,,,,,,-0.3938060
ESPTLSEDIK,ph,S,321,true,"atm and atr DNA damage response",88,25561503,"MASCOT Score",45.0000000,1.0000000,,,,,-0.0800000
ESPTLSEDIK,ph,S,321,true,"Tissue atlas Arabidopsis - ProteomicsDB",114,32188942,"MaxQuant score",272.5700000,0.9999990,,,,0,
SSDALEVPPRPIKESPTLSEDIK,ph,T,323,true,"TOR Kinase and ABA Receptor",100,29290610,XCorr,4.3680563,0.8452000,,,,0.0015910000074655,
ESPTLSEDIK,ph,T,323,true,"Tissue atlas Arabidopsis - ProteomicsDB",114,32188942,"MaxQuant score",106.4000000,0.9101410,,,,8.2767002140827E-9,
SSDALEVPPRPIKESPTLSEDIK,ph,S,325,true,"TOR Kinase and ABA Receptor",100,29290610,XCorr,4.3680563,0.9935000,,,,0.0015910000074655,
