Peptide,PTM,ModifiedAA,ModifiedPosition,PeptideUniqueToGene,ExperimentDesc,ExpID,PubmedID,ScoreType,IdentScore,LocProb,Log2FChange,PQ-val,QuantSig,PEP,MassErrorPPM
CTSSGGTCGFQNSTQICCK,ng,N,599,true,"Conserved N-glycosylation",74,22633491,"MaxQuant Score",93.8680000,1.0000000,,,,1.1709999853338E-5,0.4220000
ATELELHR,nt,A,622,true,"Arg/N-end rule seed, prt6 vs. Wt",99,29168982,"MASCOT Score",49.3500000,,0.2577137,0.7089221,NO,0.091859996318817,-0.7770302
CNGTFSCGDQR,ng,N,632,true,"Conserved N-glycosylation",74,22633491,"MaxQuant Score",143.9200000,1.0000000,,,,3.5460000278979E-13,-0.3650000
SLPITSYSSR,ph,S,910,true,"atm and atr DNA damage response",88,25561503,"MASCOT Score",34.0000000,1.0000000,,,,,0.7300000
SLPITSYSSR,ph,S,917,true,"Tissue atlas Arabidopsis - ProteomicsDB",114,32188942,"MaxQuant score",134.9900000,0.9011180,,,,1.7673099137028E-5,
DTSRNPTSTTISSSSNHSLLPSISNLANR,ph,S,941,true,"TOR Kinase and ABA Receptor",100,29290610,XCorr,4.0981927,0.8214000,,,,0.064819999039173,
NPTSTTISSSSNHSLLPSISNLANR,ph,S,941,true,"Phosphorylation Early Elicitor Signaling",23,17317660,,,,,,,,
NPTSTTISSSSNHSLLPSISNLANR,ph,S,943,true,"Large-scale phosphorylation discovery",44,23111157,XCorr,5.2220000,,,,,,
NPTSTTISSSSNHSLLPSISNLANR,ph,S,943,true,"TOR Kinase and ABA Receptor",100,29290610,XCorr,4.5988960,0.9664000,,,,0.00038869999116287,
NPTSTTISSSSNHSLLPSISNLANR,ph,S,943,true,"Tissue atlas Arabidopsis - ProteomicsDB",114,32188942,"MaxQuant score",367.9000000,0.9859690,,,,0,
VADFGLSR,ph,S,1113,false,"Tissue atlas Arabidopsis - ProteomicsDB",114,32188942,"MaxQuant score",107.8300000,1.0000000,,,,0.0038963700644672,
VLVKSPDVVDIECGGGDDVGLLR,ph,S,1254,true,"Phosphorylation Early Elicitor Signaling",23,17317660,,,,,,,,
VLVKSPDVVDIECGGGDDVGLLR,ph,S,1254,true,"STN8 phosphoproteome",38,21768351,"MASCOT Score",71.3100000,,,,,,
VLVKSPDVVDIECGGGDDVGLLR,ph,S,1254,true,"Large-scale phosphorylation discovery",44,23111157,XCorr,7.3400000,,,,,,
VLVKSPDVVDIECGGGDDVGLLR,ph,S,1254,true,"Tissue atlas Arabidopsis - ProteomicsDB",114,32188942,"MaxQuant score",252.8400000,1.0000000,,,,0,
NSVPPPISPETDKWTSSSDTAASL,ph,S,1280,true,"Tissue atlas Arabidopsis - ProteomicsDB",114,32188942,"MaxQuant score",77.2210000,0.9462060,,,,3.3733300597305E-8,
